BDBM50324315 CHEMBL1214998::Cyclohexyl-[4-(1-piperazin-1-yl[2,6]naphthyridin-3-yl)pyridin-2-yl]amine::N-cyclohexyl-4-(1-(piperazin-1-yl)-2,6-naphthyridin-3-yl)pyridin-2-amine
SMILES: C1CCC(CC1)Nc1cc(ccn1)-c1cc2cnccc2c(n1)N1CCNCC1
InChI Key: InChIKey=DIZACSOTRSXCHC-UHFFFAOYSA-N
Data: 7 IC50
Activity Spreadsheet -- Enzyme Inhibition Constant Data from BindingDB
Found 7 hits for monomerid = 50324315
Trg + Lig
Ki
nM
ΔG°
kcal/mole
IC50
nM
Kd
nM
EC50/IC50
nM
koff
s-1
kon
M-1s-1
pHTemp
°C
Serine/threonine-protein kinase D1
(Homo sapiens (Human))
BDBM50324315
(CHEMBL1214998 | Cyclohexyl-[4-(1-piperazin-1-yl[2,...)
Show SMILES C1CCC(CC1)Nc1cc(ccn1)-c1cc2cnccc2c(n1)N1CCNCC1
Show InChI InChI=1S/C23H28N6/c1-2-4-19(5-3-1)27-22-15-17(6-9-26-22)21-14-18-16-25-8-7-20(18)23(28-21)29-12-10-24-11-13-29/h6-9,14-16,19,24H,1-5,10-13H2,(H,26,27)
NCI pathway
Reactome pathway
n/an/a 0.600n/an/an/an/an/an/a
Novartis Institutes for BioMedical Research
Curated by ChEMBL
Assay Description
Inhibition of PKD1 by TR-FRET assay
J Med Chem 53: 5400-21 (2010)
Article DOI: 10.1021/jm100075z
BindingDB Entry DOI: 10.7270/Q2T153T9
Protein kinase C alpha type
(Homo sapiens (Human))
BDBM50324315
(CHEMBL1214998 | Cyclohexyl-[4-(1-piperazin-1-yl[2,...)
Show SMILES C1CCC(CC1)Nc1cc(ccn1)-c1cc2cnccc2c(n1)N1CCNCC1
Show InChI InChI=1S/C23H28N6/c1-2-4-19(5-3-1)27-22-15-17(6-9-26-22)21-14-18-16-25-8-7-20(18)23(28-21)29-12-10-24-11-13-29/h6-9,14-16,19,24H,1-5,10-13H2,(H,26,27)
NCI pathway
Reactome pathway
n/an/a 1.00E+3n/an/an/an/an/an/a
Novartis Institutes for BioMedical Research
Curated by ChEMBL
Assay Description
Inhibition of PKCalpha by TR-FRET assay
J Med Chem 53: 5400-21 (2010)
Article DOI: 10.1021/jm100075z
BindingDB Entry DOI: 10.7270/Q2T153T9
Serine/threonine-protein kinase D1
(Homo sapiens (Human))
BDBM50324315
(CHEMBL1214998 | Cyclohexyl-[4-(1-piperazin-1-yl[2,...)
Show SMILES C1CCC(CC1)Nc1cc(ccn1)-c1cc2cnccc2c(n1)N1CCNCC1
Show InChI InChI=1S/C23H28N6/c1-2-4-19(5-3-1)27-22-15-17(6-9-26-22)21-14-18-16-25-8-7-20(18)23(28-21)29-12-10-24-11-13-29/h6-9,14-16,19,24H,1-5,10-13H2,(H,26,27)
NCI pathway
Reactome pathway
n/an/a 32n/an/an/an/an/an/a
Novartis Institutes for BioMedical Research
Curated by ChEMBL
Assay Description
Inhibition of PKD1 assessed as HDAC5 neuclear export
J Med Chem 53: 5400-21 (2010)
Article DOI: 10.1021/jm100075z
BindingDB Entry DOI: 10.7270/Q2T153T9
Protein kinase C delta type
(Homo sapiens (Human))
BDBM50324315
(CHEMBL1214998 | Cyclohexyl-[4-(1-piperazin-1-yl[2,...)
Show SMILES C1CCC(CC1)Nc1cc(ccn1)-c1cc2cnccc2c(n1)N1CCNCC1
Show InChI InChI=1S/C23H28N6/c1-2-4-19(5-3-1)27-22-15-17(6-9-26-22)21-14-18-16-25-8-7-20(18)23(28-21)29-12-10-24-11-13-29/h6-9,14-16,19,24H,1-5,10-13H2,(H,26,27)
NCI pathway
Reactome pathway
n/an/a 881n/an/an/an/an/an/a
Novartis Institutes for BioMedical Research
Curated by ChEMBL
Assay Description
Inhibition of PKCdelta by TR-FRET assay
J Med Chem 53: 5400-21 (2010)
Article DOI: 10.1021/jm100075z
BindingDB Entry DOI: 10.7270/Q2T153T9
Serine/threonine-protein kinase D1
(Homo sapiens (Human))
BDBM50324315
(CHEMBL1214998 | Cyclohexyl-[4-(1-piperazin-1-yl[2,...)
Show SMILES C1CCC(CC1)Nc1cc(ccn1)-c1cc2cnccc2c(n1)N1CCNCC1
Show InChI InChI=1S/C23H28N6/c1-2-4-19(5-3-1)27-22-15-17(6-9-26-22)21-14-18-16-25-8-7-20(18)23(28-21)29-12-10-24-11-13-29/h6-9,14-16,19,24H,1-5,10-13H2,(H,26,27)
NCI pathway
Reactome pathway
n/an/a 32n/an/an/an/an/an/a
Novartis Institutes for BioMedical Research
Curated by ChEMBL
Assay Description
Inhibition of PKD1 assessed as inhibition of HDAC5 neuclear export
J Med Chem 53: 5422-38 (2010)
Article DOI: 10.1021/jm100076w
BindingDB Entry DOI: 10.7270/Q2P84C2J
Beta-1 adrenergic receptor
(Homo sapiens (Human))
BDBM50324315
(CHEMBL1214998 | Cyclohexyl-[4-(1-piperazin-1-yl[2,...)
Show SMILES C1CCC(CC1)Nc1cc(ccn1)-c1cc2cnccc2c(n1)N1CCNCC1
Show InChI InChI=1S/C23H28N6/c1-2-4-19(5-3-1)27-22-15-17(6-9-26-22)21-14-18-16-25-8-7-20(18)23(28-21)29-12-10-24-11-13-29/h6-9,14-16,19,24H,1-5,10-13H2,(H,26,27)
Reactome pathway
n/an/a 2.35E+3n/an/an/an/an/an/a
Novartis Institutes for BioMedical Research
Curated by ChEMBL
Assay Description
Inhibition of beta-1 adrenoceptor ( assessed as residual activity at 1 uM )
J Med Chem 53: 5400-21 (2010)
Article DOI: 10.1021/jm100075z
BindingDB Entry DOI: 10.7270/Q2T153T9
Serine/threonine-protein kinase D1
(Homo sapiens (Human))
BDBM50324315
(CHEMBL1214998 | Cyclohexyl-[4-(1-piperazin-1-yl[2,...)
Show SMILES C1CCC(CC1)Nc1cc(ccn1)-c1cc2cnccc2c(n1)N1CCNCC1
Show InChI InChI=1S/C23H28N6/c1-2-4-19(5-3-1)27-22-15-17(6-9-26-22)21-14-18-16-25-8-7-20(18)23(28-21)29-12-10-24-11-13-29/h6-9,14-16,19,24H,1-5,10-13H2,(H,26,27)
NCI pathway
Reactome pathway
n/an/a 0.600n/an/an/an/an/an/a
Novartis Institutes for BioMedical Research
Curated by ChEMBL
Assay Description
Inhibition of PKD1 by TR-FRET assay
J Med Chem 53: 5422-38 (2010)
Article DOI: 10.1021/jm100076w
BindingDB Entry DOI: 10.7270/Q2P84C2J