BDBM50324491 CHEMBL1215159::N-Benzhydryl-5-(3-hydroxyphenyl)thiophene-2-carboxamide
SMILES: Oc1cccc(c1)-c1ccc(s1)C(=O)NC(c1ccccc1)c1ccccc1
InChI Key: InChIKey=WSQDDOJOJZYQMI-UHFFFAOYSA-N
Data: 2 IC50
Activity Spreadsheet -- Enzyme Inhibition Constant Data from BindingDB
Found 2 hits for monomerid = 50324491
Trg + Lig
Ki
nM
ΔG°
kcal/mole
IC50
nM
Kd
nM
EC50/IC50
nM
koff
s-1
kon
M-1s-1
pHTemp
°C
Prostaglandin D Synthase
(Homo sapiens (Human))
BDBM50324491
(CHEMBL1215159 | N-Benzhydryl-5-(3-hydroxyphenyl)th...)
Show SMILES Oc1cccc(c1)-c1ccc(s1)C(=O)NC(c1ccccc1)c1ccccc1
Show InChI InChI=1S/C24H19NO2S/c26-20-13-7-12-19(16-20)21-14-15-22(28-21)24(27)25-23(17-8-3-1-4-9-17)18-10-5-2-6-11-18/h1-16,23,26H,(H,25,27)
Reactome pathway
n/an/a 7.92E+4n/an/an/an/an/an/a
The University of Queensland
Curated by ChEMBL
Assay Description
Inhibition of human H-PGDS expressed in Escherichia coli BL21 DE2 by enzyme immuno assay at 50 uM
J Med Chem 53: 5536-48 (2010)
Article DOI: 10.1021/jm100194a
BindingDB Entry DOI: 10.7270/Q21J99Z4
Prostaglandin D Synthase
(Homo sapiens (Human))
BDBM50324491
(CHEMBL1215159 | N-Benzhydryl-5-(3-hydroxyphenyl)th...)
Show SMILES Oc1cccc(c1)-c1ccc(s1)C(=O)NC(c1ccccc1)c1ccccc1
Show InChI InChI=1S/C24H19NO2S/c26-20-13-7-12-19(16-20)21-14-15-22(28-21)24(27)25-23(17-8-3-1-4-9-17)18-10-5-2-6-11-18/h1-16,23,26H,(H,25,27)
Reactome pathway
n/an/a 700n/an/an/an/an/an/a
The University of Queensland
Curated by ChEMBL
Assay Description
Inhibition of human H-PGDS expressed in Escherichia coli BL21 DE2 by enzyme immuno assay
J Med Chem 53: 5536-48 (2010)
Article DOI: 10.1021/jm100194a
BindingDB Entry DOI: 10.7270/Q21J99Z4