BDBM50324526 3-(N-Hydroxy-7-methyloctanamido)propanoic acid::CHEMBL1215523
SMILES: CC(C)CCCCCC(=O)N(O)CCC(O)=O
InChI Key: InChIKey=ZKDGGHPJDJAZCW-UHFFFAOYSA-N
Data: 2 IC50
Activity Spreadsheet -- Enzyme Inhibition Constant Data from BindingDB
Found 2 hits for monomerid = 50324526
Trg + Lig
Ki
nM
ΔG°
kcal/mole
IC50
nM
Kd
nM
EC50/IC50
nM
koff
s-1
kon
M-1s-1
pHTemp
°C
Lysine-specific demethylase 4C
(Homo sapiens (Human))
BDBM50324526
(3-(N-Hydroxy-7-methyloctanamido)propanoic acid | C...)
Show SMILES CC(C)CCCCCC(=O)N(O)CCC(O)=O
Show InChI InChI=1S/C12H23NO4/c1-10(2)6-4-3-5-7-11(14)13(17)9-8-12(15)16/h10,17H,3-9H2,1-2H3,(H,15,16)
n/an/a 7.40E+4n/an/an/an/an/an/a
Nagoya City University
Curated by ChEMBL
Assay Description
Inhibition of recombinant His-tagged JMJD2C expressed in Escherichia coli Rosetta 2 (DE3) pLysS cells by formaldehyde dehydrogenase-coupled assay
J Med Chem 53: 5629-38 (2010)
Article DOI: 10.1021/jm1003655
BindingDB Entry DOI: 10.7270/Q2N87B02
Lysine-specific demethylase 4A (KDM4A)
(Homo sapiens (Human))
BDBM50324526
(3-(N-Hydroxy-7-methyloctanamido)propanoic acid | C...)
Show SMILES CC(C)CCCCCC(=O)N(O)CCC(O)=O
Show InChI InChI=1S/C12H23NO4/c1-10(2)6-4-3-5-7-11(14)13(17)9-8-12(15)16/h10,17H,3-9H2,1-2H3,(H,15,16)
n/an/a 1.20E+5n/an/an/an/an/an/a
Nagoya City University
Curated by ChEMBL
Assay Description
Inhibition of recombinant His-tagged JMJD2A expressed in Escherichia coli Rosetta 2 (DE3) pLysS cells by formaldehyde dehydrogenase-coupled assay
J Med Chem 53: 5629-38 (2010)
Article DOI: 10.1021/jm1003655
BindingDB Entry DOI: 10.7270/Q2N87B02