BDBM50324533 3-{[7-(Dimethylamino)heptanoyl](hydroxy)amino}propanoic Acid Hydrochloride::CHEMBL1215451
SMILES: CN(C)CCCCCCC(=O)N(O)CCC(O)=O
InChI Key: InChIKey=OSICVEGFLXYBHI-UHFFFAOYSA-N
Data: 2 IC50
Activity Spreadsheet -- Enzyme Inhibition Constant Data from BindingDB
Found 2 hits for monomerid = 50324533
Trg + Lig
Ki
nM
ΔG°
kcal/mole
IC50
nM
Kd
nM
EC50/IC50
nM
koff
s-1
kon
M-1s-1
pHTemp
°C
Lysine-specific demethylase 4C
(Homo sapiens (Human))
BDBM50324533
(3-{[7-(Dimethylamino)heptanoyl](hydroxy)amino}prop...)
Show SMILES CN(C)CCCCCCC(=O)N(O)CCC(O)=O
Show InChI InChI=1S/C12H24N2O4/c1-13(2)9-6-4-3-5-7-11(15)14(18)10-8-12(16)17/h18H,3-10H2,1-2H3,(H,16,17)
n/an/a 2.70E+3n/an/an/an/an/an/a
Nagoya City University
Curated by ChEMBL
Assay Description
Inhibition of recombinant His-tagged JMJD2C expressed in Escherichia coli Rosetta 2 (DE3) pLysS cells by formaldehyde dehydrogenase-coupled assay
J Med Chem 53: 5629-38 (2010)
Article DOI: 10.1021/jm1003655
BindingDB Entry DOI: 10.7270/Q2N87B02
Lysine-specific demethylase 4A (KDM4A)
(Homo sapiens (Human))
BDBM50324533
(3-{[7-(Dimethylamino)heptanoyl](hydroxy)amino}prop...)
Show SMILES CN(C)CCCCCCC(=O)N(O)CCC(O)=O
Show InChI InChI=1S/C12H24N2O4/c1-13(2)9-6-4-3-5-7-11(15)14(18)10-8-12(16)17/h18H,3-10H2,1-2H3,(H,16,17)
n/an/a 8.70E+3n/an/an/an/an/an/a
Nagoya City University
Curated by ChEMBL
Assay Description
Inhibition of recombinant His-tagged JMJD2A expressed in Escherichia coli Rosetta 2 (DE3) pLysS cells by formaldehyde dehydrogenase-coupled assay
J Med Chem 53: 5629-38 (2010)
Article DOI: 10.1021/jm1003655
BindingDB Entry DOI: 10.7270/Q2N87B02