BDBM50324911 4-(2-amino-5-chloro-1H-benzo[d]imidazol-1-yl)-N-(cyclopropylmethyl)butanamide::CHEMBL1222034
SMILES: Nc1nc2cc(Cl)ccc2n1CCCC(=O)NCC1CC1
InChI Key: InChIKey=AHNGNPKUTAWEGW-UHFFFAOYSA-N
Data: 1 IC50
Activity Spreadsheet -- Enzyme Inhibition Constant Data from BindingDB
Found 1 hit for monomerid = 50324911
Trg + Lig
Ki
nM
ΔG°
kcal/mole
IC50
nM
Kd
nM
EC50/IC50
nM
koff
s-1
kon
M-1s-1
pHTemp
°C
Beta-secretase 1
(Homo sapiens (Human))
BDBM50324911
(4-(2-amino-5-chloro-1H-benzo[d]imidazol-1-yl)-N-(c...)
Show SMILES Nc1nc2cc(Cl)ccc2n1CCCC(=O)NCC1CC1
Show InChI InChI=1S/C15H19ClN4O/c16-11-5-6-13-12(8-11)19-15(17)20(13)7-1-2-14(21)18-9-10-3-4-10/h5-6,8,10H,1-4,7,9H2,(H2,17,19)(H,18,21)
n/an/a 2.85E+6n/an/an/an/an/an/a
Evotec UK Ltd
Curated by ChEMBL
Assay Description
Inhibition of BACE1 assessed as amyloid beta secretion by cell based assay
Bioorg Med Chem Lett 20: 5329-33 (2010)
Article DOI: 10.1016/j.bmcl.2010.06.089
BindingDB Entry DOI: 10.7270/Q2VQ32W7