BDBM50325044 1-((1-benzyl-1H-tetrazol-5-yl)(4-fluorophenyl)methyl)-4-cyclobutylpiperazine::CHEMBL1222808
SMILES: Fc1ccc(cc1)C(N1CCN(CC1)C1CCC1)c1nnnn1Cc1ccccc1
InChI Key: InChIKey=WZFPOJSSIOEAMZ-UHFFFAOYSA-N
Data: 1 IC50
Activity Spreadsheet -- Enzyme Inhibition Constant Data from BindingDB
Found 1 hit for monomerid = 50325044
Trg + Lig
Ki
nM
ΔG°
kcal/mole
IC50
nM
Kd
nM
EC50/IC50
nM
koff
s-1
kon
M-1s-1
pHTemp
°C
Histamine H3 receptor
(Homo sapiens (Human))
BDBM50325044
(1-((1-benzyl-1H-tetrazol-5-yl)(4-fluorophenyl)meth...)
Show SMILES Fc1ccc(cc1)C(N1CCN(CC1)C1CCC1)c1nnnn1Cc1ccccc1
Show InChI InChI=1S/C23H27FN6/c24-20-11-9-19(10-12-20)22(29-15-13-28(14-16-29)21-7-4-8-21)23-25-26-27-30(23)17-18-5-2-1-3-6-18/h1-3,5-6,9-12,21-22H,4,7-8,13-17H2
Reactome pathway
n/an/a 25n/an/an/an/an/an/a
Evotec (UK) Ltd
Curated by ChEMBL
Assay Description
Antagonist activity at human histamine H3 receptor
Bioorg Med Chem Lett 20: 5165-9 (2010)
Article DOI: 10.1016/j.bmcl.2010.07.009
BindingDB Entry DOI: 10.7270/Q2TQ61RV