BDBM50325076 1-((1-benzyl-1H-tetrazol-5-yl)(4-ethoxyphenyl)methyl)-4-cyclobutyl-1,4-diazepane::CHEMBL1223379
SMILES: CCOc1ccc(cc1)C(N1CCCN(CC1)C1CCC1)c1nnnn1Cc1ccccc1
InChI Key: InChIKey=UOQMGXSTRBOUDI-UHFFFAOYSA-N
Data: 1 IC50
Activity Spreadsheet -- Enzyme Inhibition Constant Data from BindingDB
Found 1 hit for monomerid = 50325076
Trg + Lig
Ki
nM
ΔG°
kcal/mole
IC50
nM
Kd
nM
EC50/IC50
nM
koff
s-1
kon
M-1s-1
pHTemp
°C
Histamine H3 receptor
(Homo sapiens (Human))
BDBM50325076
(1-((1-benzyl-1H-tetrazol-5-yl)(4-ethoxyphenyl)meth...)
Show SMILES CCOc1ccc(cc1)C(N1CCCN(CC1)C1CCC1)c1nnnn1Cc1ccccc1
Show InChI InChI=1S/C26H34N6O/c1-2-33-24-14-12-22(13-15-24)25(31-17-7-16-30(18-19-31)23-10-6-11-23)26-27-28-29-32(26)20-21-8-4-3-5-9-21/h3-5,8-9,12-15,23,25H,2,6-7,10-11,16-20H2,1H3
Reactome pathway
n/an/a 14n/an/an/an/an/an/a
Evotec (UK) Ltd
Curated by ChEMBL
Assay Description
Antagonist activity at human histamine H3 receptor
Bioorg Med Chem Lett 20: 5165-9 (2010)
Article DOI: 10.1016/j.bmcl.2010.07.009
BindingDB Entry DOI: 10.7270/Q2TQ61RV