BDBM50325146 8-(1H-imidazol-4-yl)-5-methyl-[1,2,4]triazolo[4,3-a]quinolin-1(2H)-one::CHEMBL1223529
SMILES: Cc1cc2n[nH]c(=O)n2c2cc(ccc12)-c1c[nH]cn1
InChI Key: InChIKey=HLONSMJEWKMJRV-UHFFFAOYSA-N
Data: 1 IC50
Activity Spreadsheet -- Enzyme Inhibition Constant Data from BindingDB
Found 1 hit for monomerid = 50325146
Trg + Lig
Ki
nM
ΔG°
kcal/mole
IC50
nM
Kd
nM
EC50/IC50
nM
koff
s-1
kon
M-1s-1
pHTemp
°C
Serine/threonine-protein kinase Chk1
(Homo sapiens (Human))
BDBM50325146
(8-(1H-imidazol-4-yl)-5-methyl-[1,2,4]triazolo[4,3-...)
Show SMILES Cc1cc2n[nH]c(=O)n2c2cc(ccc12)-c1c[nH]cn1
Show InChI InChI=1S/C14H11N5O/c1-8-4-13-17-18-14(20)19(13)12-5-9(2-3-10(8)12)11-6-15-7-16-11/h2-7H,1H3,(H,15,16)(H,18,20)
Reactome pathway
n/an/a 160n/an/an/an/an/an/a
AstraZeneca R&D Boston
Curated by ChEMBL
Assay Description
Inhibition of His6-CHK1 expressed in baculovirus infected Sf9 cells
Bioorg Med Chem Lett 20: 5133-8 (2010)
Article DOI: 10.1016/j.bmcl.2010.07.015
BindingDB Entry DOI: 10.7270/Q2FF3SJZ
3D
3D Structure (docked)