BDBM50325151 5-methyl-8-(4-(2-morpholinoethoxy)phenyl)-[1,2,4]triazolo[4,3-a]quinolin-1(2H)-one::CHEMBL1223169
SMILES: Cc1cc2n[nH]c(=O)n2c2cc(ccc12)-c1ccc(OCCN2CCOCC2)cc1
InChI Key: InChIKey=QDJLLXGMPVLYDJ-UHFFFAOYSA-N
Data: 1 IC50
Activity Spreadsheet -- Enzyme Inhibition Constant Data from BindingDB
Found 1 hit for monomerid = 50325151
Trg + Lig
Ki
nM
ΔG°
kcal/mole
IC50
nM
Kd
nM
EC50/IC50
nM
koff
s-1
kon
M-1s-1
pHTemp
°C
Serine/threonine-protein kinase Chk1
(Homo sapiens (Human))
BDBM50325151
(5-methyl-8-(4-(2-morpholinoethoxy)phenyl)-[1,2,4]t...)
Show SMILES Cc1cc2n[nH]c(=O)n2c2cc(ccc12)-c1ccc(OCCN2CCOCC2)cc1
Show InChI InChI=1S/C23H24N4O3/c1-16-14-22-24-25-23(28)27(22)21-15-18(4-7-20(16)21)17-2-5-19(6-3-17)30-13-10-26-8-11-29-12-9-26/h2-7,14-15H,8-13H2,1H3,(H,25,28)
Reactome pathway
n/an/a 30n/an/an/an/an/an/a
AstraZeneca R&D Boston
Curated by ChEMBL
Assay Description
Inhibition of His6-CHK1 expressed in baculovirus infected Sf9 cells
Bioorg Med Chem Lett 20: 5133-8 (2010)
Article DOI: 10.1016/j.bmcl.2010.07.015
BindingDB Entry DOI: 10.7270/Q2FF3SJZ