BDBM50325171 5-METHYL-8-PYRIDIN-4-YL[1,2,4]TRIAZOLO[4,3-A]QUINOLIN-1(2H)-ONE::5-methyl-8-(pyridin-4-yl)-[1,2,4]triazolo[4,3-a]quinolin-1(2H)-one::CHEMBL1223458
SMILES: Cc1cc2n[nH]c(=O)n2c2cc(ccc12)-c1ccncc1
InChI Key: InChIKey=PKZCGWBROCHAKF-UHFFFAOYSA-N
Data: 1 IC50
PDB links: 1 PDB ID matches this monomer.
Activity Spreadsheet -- Enzyme Inhibition Constant Data from BindingDB
Found 1 hit for monomerid = 50325171
Trg + Lig
Ki
nM
ΔG°
kcal/mole
IC50
nM
Kd
nM
EC50/IC50
nM
koff
s-1
kon
M-1s-1
pHTemp
°C
Serine/threonine-protein kinase Chk1
(Homo sapiens (Human))
BDBM50325171
(5-METHYL-8-PYRIDIN-4-YL[1,2,4]TRIAZOLO[4,3-A]QUINO...)
Show SMILES Cc1cc2n[nH]c(=O)n2c2cc(ccc12)-c1ccncc1
Show InChI InChI=1S/C16H12N4O/c1-10-8-15-18-19-16(21)20(15)14-9-12(2-3-13(10)14)11-4-6-17-7-5-11/h2-9H,1H3,(H,19,21)
Reactome pathway
n/an/a 14n/an/an/an/an/an/a
AstraZeneca R&D Boston
Curated by ChEMBL
Assay Description
Inhibition of His6-CHK1 expressed in baculovirus infected Sf9 cells
Bioorg Med Chem Lett 20: 5133-8 (2010)
Article DOI: 10.1016/j.bmcl.2010.07.015
BindingDB Entry DOI: 10.7270/Q2FF3SJZ
3D
3D Structure (crystal)