BDBM50325173 5-methyl-8-(pyrazin-2-yl)-[1,2,4]triazolo[4,3-a]quinolin-1(2H)-one::CHEMBL1223460
SMILES: Cc1cc2n[nH]c(=O)n2c2cc(ccc12)-c1cnccn1
InChI Key: InChIKey=KFTPBQKHHFAIMC-UHFFFAOYSA-N
Data: 1 IC50
Activity Spreadsheet -- Enzyme Inhibition Constant Data from BindingDB
Found 1 hit for monomerid = 50325173
Trg + Lig
Ki
nM
ΔG°
kcal/mole
IC50
nM
Kd
nM
EC50/IC50
nM
koff
s-1
kon
M-1s-1
pHTemp
°C
Serine/threonine-protein kinase Chk1
(Homo sapiens (Human))
BDBM50325173
(5-methyl-8-(pyrazin-2-yl)-[1,2,4]triazolo[4,3-a]qu...)
Show SMILES Cc1cc2n[nH]c(=O)n2c2cc(ccc12)-c1cnccn1
Show InChI InChI=1S/C15H11N5O/c1-9-6-14-18-19-15(21)20(14)13-7-10(2-3-11(9)13)12-8-16-4-5-17-12/h2-8H,1H3,(H,19,21)
Reactome pathway
n/an/a 1.59E+3n/an/an/an/an/an/a
AstraZeneca R&D Boston
Curated by ChEMBL
Assay Description
Inhibition of His6-CHK1 expressed in baculovirus infected Sf9 cells
Bioorg Med Chem Lett 20: 5133-8 (2010)
Article DOI: 10.1016/j.bmcl.2010.07.015
BindingDB Entry DOI: 10.7270/Q2FF3SJZ
3D
3D Structure (docked)