null
SMILES: Cc1cc2n[nH]c(=O)n2c2cc(ccc12)-c1cccs1
InChI Key: InChIKey=LVOFPVMDPPUJMM-UHFFFAOYSA-N
Activity Spreadsheet -- Enzyme Inhibition Constant Data from BindingDB
Found 2 hits for monomerid = 50325175
Trg + Lig
Ki
nM
ΔG°
kcal/mole
IC50
nM
Kd
nM
EC50/IC50
nM
koff
s-1
kon
M-1s-1
pHTemp
°C
Serine/threonine-protein kinase Chk1
(Homo sapiens (Human))
BDBM50325175
(5-methyl-8-(thiophen-2-yl)-[1,2,4]triazolo[4,3-a]q...)
Show SMILES Cc1cc2n[nH]c(=O)n2c2cc(ccc12)-c1cccs1
Show InChI InChI=1S/C15H11N3OS/c1-9-7-14-16-17-15(19)18(14)12-8-10(4-5-11(9)12)13-3-2-6-20-13/h2-8H,1H3,(H,17,19)
Reactome pathway
n/an/a 20n/an/an/an/an/an/a
AstraZeneca R&D Boston
Curated by ChEMBL
Assay Description
Inhibition of Chk1
Bioorg Med Chem Lett 22: 2330-7 (2012)
Article DOI: 10.1016/j.bmcl.2012.01.043
BindingDB Entry DOI: 10.7270/Q2GM88B0
Serine/threonine-protein kinase Chk1
(Homo sapiens (Human))
BDBM50325175
(5-methyl-8-(thiophen-2-yl)-[1,2,4]triazolo[4,3-a]q...)
Show SMILES Cc1cc2n[nH]c(=O)n2c2cc(ccc12)-c1cccs1
Show InChI InChI=1S/C15H11N3OS/c1-9-7-14-16-17-15(19)18(14)12-8-10(4-5-11(9)12)13-3-2-6-20-13/h2-8H,1H3,(H,17,19)
Reactome pathway
n/an/a 20n/an/an/an/an/an/a
AstraZeneca R&D Boston
Curated by ChEMBL
Assay Description
Inhibition of His6-CHK1 expressed in baculovirus infected Sf9 cells
Bioorg Med Chem Lett 20: 5133-8 (2010)
Article DOI: 10.1016/j.bmcl.2010.07.015
BindingDB Entry DOI: 10.7270/Q2FF3SJZ