BDBM50325216 2-(4-((1H-1,2,4-Triazol-1-yl)methyl)-5-(4-bromophenyl)-1-(2,4-dichlorophenyl)-1H-pyrazol-3-yl)-5-(1-methylcyclopropyl)-1,3,4-thiadiazole::CHEMBL1223035
SMILES: CC1(CC1)c1nnc(s1)-c1nn(c(c1Cn1cncn1)-c1ccc(Br)cc1)-c1ccc(Cl)cc1Cl
InChI Key: InChIKey=QRDTXIMABLUXNV-UHFFFAOYSA-N
Data: 1 IC50
Activity Spreadsheet -- Enzyme Inhibition Constant Data from BindingDB
Found 1 hit for monomerid = 50325216
Trg + Lig
Ki
nM
ΔG°
kcal/mole
IC50
nM
Kd
nM
EC50/IC50
nM
koff
s-1
kon
M-1s-1
pHTemp
°C
Cannabinoid receptor 1
(Rattus norvegicus (rat))
BDBM50325216
(2-(4-((1H-1,2,4-Triazol-1-yl)methyl)-5-(4-bromophe...)
Show SMILES CC1(CC1)c1nnc(s1)-c1nn(c(c1Cn1cncn1)-c1ccc(Br)cc1)-c1ccc(Cl)cc1Cl
Show InChI InChI=1S/C24H18BrCl2N7S/c1-24(8-9-24)23-31-30-22(35-23)20-17(11-33-13-28-12-29-33)21(14-2-4-15(25)5-3-14)34(32-20)19-7-6-16(26)10-18(19)27/h2-7,10,12-13H,8-9,11H2,1H3
Reactome pathway
n/an/a 2.91n/an/an/an/an/an/a
Green Cross Corporation
Curated by ChEMBL
Assay Description
Displacement of [3H]CP-55940 from CB1 receptor in Sprague-Dawley rat cerebellum after 1 hr by liquid scintillation counting
Bioorg Med Chem 18: 6377-88 (2010)
Article DOI: 10.1016/j.bmc.2010.07.013
BindingDB Entry DOI: 10.7270/Q2XG9RBT