BDBM50325229 2-(4-((1H-1,2,4-Triazol-1-yl)methyl)-1-(2-chlorophenyl)-5-(4-chlorophenyl)-1H-pyrazol-3-yl)-5-(1-(trifluoromethyl)-cyclopropyl)-1,3,4-thiadiazole::CHEMBL1223178
SMILES: FC(F)(F)C1(CC1)c1nnc(s1)-c1nn(c(c1Cn1cncn1)-c1ccc(Cl)cc1)-c1ccccc1Cl
InChI Key: InChIKey=GCSATLOGNWPROA-UHFFFAOYSA-N
Data: 1 IC50
Activity Spreadsheet -- Enzyme Inhibition Constant Data from BindingDB
Found 1 hit for monomerid = 50325229
Trg + Lig
Ki
nM
ΔG°
kcal/mole
IC50
nM
Kd
nM
EC50/IC50
nM
koff
s-1
kon
M-1s-1
pHTemp
°C
Cannabinoid receptor 1
(Rattus norvegicus (rat))
BDBM50325229
(2-(4-((1H-1,2,4-Triazol-1-yl)methyl)-1-(2-chloroph...)
Show SMILES FC(F)(F)C1(CC1)c1nnc(s1)-c1nn(c(c1Cn1cncn1)-c1ccc(Cl)cc1)-c1ccccc1Cl
Show InChI InChI=1S/C24H16Cl2F3N7S/c25-15-7-5-14(6-8-15)20-16(11-35-13-30-12-31-35)19(34-36(20)18-4-2-1-3-17(18)26)21-32-33-22(37-21)23(9-10-23)24(27,28)29/h1-8,12-13H,9-11H2
Reactome pathway
n/an/a 1.66n/an/an/an/an/an/a
Green Cross Corporation
Curated by ChEMBL
Assay Description
Displacement of [3H]CP-55940 from CB1 receptor in Sprague-Dawley rat cerebellum after 1 hr by liquid scintillation counting
Bioorg Med Chem 18: 6377-88 (2010)
Article DOI: 10.1016/j.bmc.2010.07.013
BindingDB Entry DOI: 10.7270/Q2XG9RBT