BDBM50325468 1-(2-phenoxyethyl)-3-(1-(1-(pyridin-4-ylmethyl)piperidine-4-carbonyl)piperidin-4-yl)-1H-benzo[d]imidazol-2(3H)-one::CHEMBL1222798
SMILES: O=C(C1CCN(Cc2ccncc2)CC1)N1CCC(CC1)n1c2ccccc2n(CCOc2ccccc2)c1=O
InChI Key: InChIKey=QEXOFWNDNHZFRD-UHFFFAOYSA-N
Data: 1 KI  2 IC50  1 Kd
Activity Spreadsheet -- Enzyme Inhibition Constant Data from BindingDB
Found 4 hits for monomerid = 50325468
Trg + Lig
Ki
nM
ΔG°
kcal/mole
IC50
nM
Kd
nM
EC50/IC50
nM
koff
s-1
kon
M-1s-1
pHTemp
°C
HRH3
(GUINEA PIG)
BDBM50325468
(1-(2-phenoxyethyl)-3-(1-(1-(pyridin-4-ylmethyl)pip...)
Show SMILES O=C(C1CCN(Cc2ccncc2)CC1)N1CCC(CC1)n1c2ccccc2n(CCOc2ccccc2)c1=O
Show InChI InChI=1S/C32H37N5O3/c38-31(26-12-18-34(19-13-26)24-25-10-16-33-17-11-25)35-20-14-27(15-21-35)37-30-9-5-4-8-29(30)36(32(37)39)22-23-40-28-6-2-1-3-7-28/h1-11,16-17,26-27H,12-15,18-24H2
2n/an/an/an/an/an/an/an/a
Merck Research Laboratories
Curated by ChEMBL
Assay Description
Displacement of [3H]Nalpha-methylhistamine from histamine H3 receptor in guinea pig brain
Bioorg Med Chem Lett 20: 5004-8 (2010)
Article DOI: 10.1016/j.bmcl.2010.07.052
BindingDB Entry DOI: 10.7270/Q2N016QS
Cytochrome P450 3A4
(Homo sapiens (Human))
BDBM50325468
(1-(2-phenoxyethyl)-3-(1-(1-(pyridin-4-ylmethyl)pip...)
Show SMILES O=C(C1CCN(Cc2ccncc2)CC1)N1CCC(CC1)n1c2ccccc2n(CCOc2ccccc2)c1=O
Show InChI InChI=1S/C32H37N5O3/c38-31(26-12-18-34(19-13-26)24-25-10-16-33-17-11-25)35-20-14-27(15-21-35)37-30-9-5-4-8-29(30)36(32(37)39)22-23-40-28-6-2-1-3-7-28/h1-11,16-17,26-27H,12-15,18-24H2
Reactome pathway
n/an/a 9.00E+3n/an/an/an/an/an/a
Merck Research Laboratories
Curated by ChEMBL
Assay Description
Inhibition of CYP3A4 in human liver microsomes
Bioorg Med Chem Lett 20: 5004-8 (2010)
Article DOI: 10.1016/j.bmcl.2010.07.052
BindingDB Entry DOI: 10.7270/Q2N016QS
HRH3
(GUINEA PIG)
BDBM50325468
(1-(2-phenoxyethyl)-3-(1-(1-(pyridin-4-ylmethyl)pip...)
Show SMILES O=C(C1CCN(Cc2ccncc2)CC1)N1CCC(CC1)n1c2ccccc2n(CCOc2ccccc2)c1=O
Show InChI InChI=1S/C32H37N5O3/c38-31(26-12-18-34(19-13-26)24-25-10-16-33-17-11-25)35-20-14-27(15-21-35)37-30-9-5-4-8-29(30)36(32(37)39)22-23-40-28-6-2-1-3-7-28/h1-11,16-17,26-27H,12-15,18-24H2
n/an/an/a 0.794n/an/an/an/an/a
Merck Research Laboratories
Curated by ChEMBL
Assay Description
Antagonist activity at histamine H3 receptor in electrically-stimulated guinea pig ileum
Bioorg Med Chem Lett 20: 5004-8 (2010)
Article DOI: 10.1016/j.bmcl.2010.07.052
BindingDB Entry DOI: 10.7270/Q2N016QS
Cytochrome P450 2D6
(Homo sapiens (Human))
BDBM50325468
(1-(2-phenoxyethyl)-3-(1-(1-(pyridin-4-ylmethyl)pip...)
Show SMILES O=C(C1CCN(Cc2ccncc2)CC1)N1CCC(CC1)n1c2ccccc2n(CCOc2ccccc2)c1=O
Show InChI InChI=1S/C32H37N5O3/c38-31(26-12-18-34(19-13-26)24-25-10-16-33-17-11-25)35-20-14-27(15-21-35)37-30-9-5-4-8-29(30)36(32(37)39)22-23-40-28-6-2-1-3-7-28/h1-11,16-17,26-27H,12-15,18-24H2
n/an/a 2.00E+4n/an/an/an/an/an/a
Merck Research Laboratories
Curated by ChEMBL
Assay Description
Inhibition of CYP2D6 in human liver microsomes
Bioorg Med Chem Lett 20: 5004-8 (2010)
Article DOI: 10.1016/j.bmcl.2010.07.052
BindingDB Entry DOI: 10.7270/Q2N016QS