BDBM50325497 4-bromo-2-(4-isopropylphenyl)-7-methoxy-1-(2-methoxyethyl)-1H-benzo[d]imidazole::CHEMBL1223367
SMILES: COCCn1c(nc2c(Br)ccc(OC)c12)-c1ccc(cc1)C(C)C
InChI Key: InChIKey=MUNWQWHRPBVEMS-UHFFFAOYSA-N
Data: 1 IC50
Activity Spreadsheet -- Enzyme Inhibition Constant Data from BindingDB
Found 1 hit for monomerid = 50325497
Trg + Lig
Ki
nM
ΔG°
kcal/mole
IC50
nM
Kd
nM
EC50/IC50
nM
koff
s-1
kon
M-1s-1
pHTemp
°C
Calcium-sensing receptor (CaSR)
(Homo sapiens (Human))
BDBM50325497
(4-bromo-2-(4-isopropylphenyl)-7-methoxy-1-(2-metho...)
Show SMILES COCCn1c(nc2c(Br)ccc(OC)c12)-c1ccc(cc1)C(C)C
Show InChI InChI=1S/C20H23BrN2O2/c1-13(2)14-5-7-15(8-6-14)20-22-18-16(21)9-10-17(25-4)19(18)23(20)11-12-24-3/h5-10,13H,11-12H2,1-4H3
n/an/a 22n/an/an/an/an/an/a
Novartis Institutes for BioMedical Research
Curated by ChEMBL
Assay Description
Antagonist activity at human CaSR expressed in hamster fibroblasts assessed as inhibition of calcium mobilization
Bioorg Med Chem Lett 20: 5161-4 (2010)
Article DOI: 10.1016/j.bmcl.2010.07.016
BindingDB Entry DOI: 10.7270/Q2H70G1X