BDBM50325521 2-(4-isopropylphenyl)-7-methoxy-1-(2-methoxyethyl)-5-((2-methoxypyridin-3-yl)methyl)-4-(trifluoromethyl)-1H-benzo[d]imidazole::CHEMBL1223712
SMILES: COCCn1c(nc2c(c(Cc3cccnc3OC)cc(OC)c12)C(F)(F)F)-c1ccc(cc1)C(C)C
InChI Key: InChIKey=NIQSGWJDOXIURI-UHFFFAOYSA-N
Data: 1 IC50
Activity Spreadsheet -- Enzyme Inhibition Constant Data from BindingDB
Found 1 hit for monomerid = 50325521
Trg + Lig
Ki
nM
ΔG°
kcal/mole
IC50
nM
Kd
nM
EC50/IC50
nM
koff
s-1
kon
M-1s-1
pHTemp
°C
Calcium-sensing receptor (CaSR)
(Homo sapiens (Human))
BDBM50325521
(2-(4-isopropylphenyl)-7-methoxy-1-(2-methoxyethyl)...)
Show SMILES COCCn1c(nc2c(c(Cc3cccnc3OC)cc(OC)c12)C(F)(F)F)-c1ccc(cc1)C(C)C
Show InChI InChI=1S/C28H30F3N3O3/c1-17(2)18-8-10-19(11-9-18)26-33-24-23(28(29,30)31)21(15-20-7-6-12-32-27(20)37-5)16-22(36-4)25(24)34(26)13-14-35-3/h6-12,16-17H,13-15H2,1-5H3
n/an/a 4n/an/an/an/an/an/a
Novartis Institutes for BioMedical Research
Curated by ChEMBL
Assay Description
Antagonist activity at human CaSR expressed in hamster fibroblasts assessed as inhibition of calcium mobilization
Bioorg Med Chem Lett 20: 5161-4 (2010)
Article DOI: 10.1016/j.bmcl.2010.07.016
BindingDB Entry DOI: 10.7270/Q2H70G1X