BDBM50325629 CHEMBL1224237::benzo[b]thiophen-2-yl(3-(3,3-dimethylbutyl)pyrrolidin-3-yl)methanone
SMILES: CC(C)(C)CCC1(CCNC1)C(=O)c1cc2ccccc2s1
InChI Key: InChIKey=MUCOWQIQUFKAFL-UHFFFAOYSA-N
Data: 1 IC50
Activity Spreadsheet -- Enzyme Inhibition Constant Data from BindingDB
Found 1 hit for monomerid = 50325629
Trg + Lig
Ki
nM
ΔG°
kcal/mole
IC50
nM
Kd
nM
EC50/IC50
nM
koff
s-1
kon
M-1s-1
pHTemp
°C
Cytochrome P450 2D6
(Homo sapiens (Human))
BDBM50325629
(CHEMBL1224237 | benzo[b]thiophen-2-yl(3-(3,3-dimet...)
Show SMILES CC(C)(C)CCC1(CCNC1)C(=O)c1cc2ccccc2s1
Show InChI InChI=1S/C19H25NOS/c1-18(2,3)8-9-19(10-11-20-13-19)17(21)16-12-14-6-4-5-7-15(14)22-16/h4-7,12,20H,8-11,13H2,1-3H3
n/an/a 1.20E+4n/an/an/an/an/an/a
Roche Palo Alto LLC
Curated by ChEMBL
Assay Description
Inhibition of CYP2D6
Bioorg Med Chem Lett 20: 5559-66 (2010)
Article DOI: 10.1016/j.bmcl.2010.07.020
BindingDB Entry DOI: 10.7270/Q20865HF