BDBM50325635 (4-amino-3-chlorophenyl)(2-(isopropoxymethyl)pyrrolidin-2-yl)methanone::CHEMBL1224091
SMILES: CC(C)OCC1(CCCN1)C(=O)c1ccc(N)c(Cl)c1
InChI Key: InChIKey=HFJPQKBQGCFBQI-UHFFFAOYSA-N
Data: 2 IC50
Activity Spreadsheet -- Enzyme Inhibition Constant Data from BindingDB
Found 2 hits for monomerid = 50325635
Trg + Lig
Ki
nM
ΔG°
kcal/mole
IC50
nM
Kd
nM
EC50/IC50
nM
koff
s-1
kon
M-1s-1
pHTemp
°C
Cytochrome P450 2D6
(Homo sapiens (Human))
BDBM50325635
((4-amino-3-chlorophenyl)(2-(isopropoxymethyl)pyrro...)
Show SMILES CC(C)OCC1(CCCN1)C(=O)c1ccc(N)c(Cl)c1
Show InChI InChI=1S/C15H21ClN2O2/c1-10(2)20-9-15(6-3-7-18-15)14(19)11-4-5-13(17)12(16)8-11/h4-5,8,10,18H,3,6-7,9,17H2,1-2H3
n/an/a 1.40E+4n/an/an/an/an/an/a
Roche Palo Alto LLC
Curated by ChEMBL
Assay Description
Inhibition of CYP2D6
Bioorg Med Chem Lett 20: 5559-66 (2010)
Article DOI: 10.1016/j.bmcl.2010.07.020
BindingDB Entry DOI: 10.7270/Q20865HF
Potassium voltage-gated channel subfamily H member 2
(Homo sapiens (Human))
BDBM50325635
((4-amino-3-chlorophenyl)(2-(isopropoxymethyl)pyrro...)
Show SMILES CC(C)OCC1(CCCN1)C(=O)c1ccc(N)c(Cl)c1
Show InChI InChI=1S/C15H21ClN2O2/c1-10(2)20-9-15(6-3-7-18-15)14(19)11-4-5-13(17)12(16)8-11/h4-5,8,10,18H,3,6-7,9,17H2,1-2H3
Reactome pathway
n/an/a>1.00E+4n/an/an/an/an/an/a
Roche Palo Alto LLC
Curated by ChEMBL
Assay Description
Inhibition of human ERG
Bioorg Med Chem Lett 20: 5559-66 (2010)
Article DOI: 10.1016/j.bmcl.2010.07.020
BindingDB Entry DOI: 10.7270/Q20865HF