BDBM50325643 1-(4-Fluorophenyl)-3-trifluoromethyl-5-(3-methyl-2-oxo-3H-benzoxazole-6-yl)-1H-pyrazole::CHEMBL1224099
SMILES: Cn1c2ccc(cc2oc1=O)-c1cc(nn1-c1ccc(F)cc1)C(F)(F)F
InChI Key: InChIKey=YKOUXSMVMVBXAV-UHFFFAOYSA-N
Data: 2 IC50
Activity Spreadsheet -- Enzyme Inhibition Constant Data from BindingDB
Found 2 hits for monomerid = 50325643
Trg + Lig
Ki
nM
ΔG°
kcal/mole
IC50
nM
Kd
nM
EC50/IC50
nM
koff
s-1
kon
M-1s-1
pHTemp
°C
Prostaglandin G/H synthase (Cyclooxygenase-2)
(Ovis aries (Sheep))
BDBM50325643
(1-(4-Fluorophenyl)-3-trifluoromethyl-5-(3-methyl-2...)
Show SMILES Cn1c2ccc(cc2oc1=O)-c1cc(nn1-c1ccc(F)cc1)C(F)(F)F
Show InChI InChI=1S/C18H11F4N3O2/c1-24-13-7-2-10(8-15(13)27-17(24)26)14-9-16(18(20,21)22)23-25(14)12-5-3-11(19)4-6-12/h2-9H,1H3
n/an/a 1.00E+3n/an/an/an/an/an/a
Gazi University
Curated by ChEMBL
Assay Description
Inhibition of sheep COX2 by enzyme immunoassay
Bioorg Med Chem 18: 6367-76 (2010)
Article DOI: 10.1016/j.bmc.2010.07.009
BindingDB Entry DOI: 10.7270/Q2VH5P15
Prostaglandin G/H synthase (cyclooxygenase)
(Ovis aries (Sheep))
BDBM50325643
(1-(4-Fluorophenyl)-3-trifluoromethyl-5-(3-methyl-2...)
Show SMILES Cn1c2ccc(cc2oc1=O)-c1cc(nn1-c1ccc(F)cc1)C(F)(F)F
Show InChI InChI=1S/C18H11F4N3O2/c1-24-13-7-2-10(8-15(13)27-17(24)26)14-9-16(18(20,21)22)23-25(14)12-5-3-11(19)4-6-12/h2-9H,1H3
n/an/a 6.00E+3n/an/an/an/an/an/a
Gazi University
Curated by ChEMBL
Assay Description
Inhibition of sheep COX1 by enzyme immunoassay
Bioorg Med Chem 18: 6367-76 (2010)
Article DOI: 10.1016/j.bmc.2010.07.009
BindingDB Entry DOI: 10.7270/Q2VH5P15