BDBM50325849 3-((1R,3r,5S)-8-(cyclohexylmethyl)-8-azabicyclo[3.2.1]octan-3-yloxy)benzamide::CHEMBL1223816
SMILES: NC(=O)c1cccc(O[C@@H]2C[C@@H]3CC[C@H](C2)N3CC2CCCCC2)c1
InChI Key: InChIKey=ZKZMTIDHRGLEJP-RUYXUALKSA-N
Data: 4 IC50
Activity Spreadsheet -- Enzyme Inhibition Constant Data from BindingDB
Found 4 hits for monomerid = 50325849
Trg + Lig
Ki
nM
ΔG°
kcal/mole
IC50
nM
Kd
nM
EC50/IC50
nM
koff
s-1
kon
M-1s-1
pHTemp
°C
Delta-type opioid receptor
(Homo sapiens (Human))
BDBM50325849
(3-((1R,3r,5S)-8-(cyclohexylmethyl)-8-azabicyclo[3....)
Show SMILES NC(=O)c1cccc(O[C@@H]2C[C@@H]3CC[C@H](C2)N3CC2CCCCC2)c1 |r,TLB:17:16:9.10.15:12.13|
Show InChI InChI=1S/C21H30N2O2/c22-21(24)16-7-4-8-19(11-16)25-20-12-17-9-10-18(13-20)23(17)14-15-5-2-1-3-6-15/h4,7-8,11,15,17-18,20H,1-3,5-6,9-10,12-14H2,(H2,22,24)/t17-,18+,20+
Reactome pathway
n/an/a>3.00E+4n/an/an/an/an/an/a
AstraZeneca Pharmaceuticals
Curated by ChEMBL
Assay Description
Antagonist activity at human delta opioid receptor expressed in HEK cells assessed as inhibition of SNC-80-induced [35S]GTPgammaS binding
Bioorg Med Chem Lett 20: 5405-10 (2010)
Article DOI: 10.1016/j.bmcl.2010.07.112
BindingDB Entry DOI: 10.7270/Q2X92BHQ
Potassium voltage-gated channel subfamily H member 2
(Homo sapiens (Human))
BDBM50325849
(3-((1R,3r,5S)-8-(cyclohexylmethyl)-8-azabicyclo[3....)
Show SMILES NC(=O)c1cccc(O[C@@H]2C[C@@H]3CC[C@H](C2)N3CC2CCCCC2)c1 |r,TLB:17:16:9.10.15:12.13|
Show InChI InChI=1S/C21H30N2O2/c22-21(24)16-7-4-8-19(11-16)25-20-12-17-9-10-18(13-20)23(17)14-15-5-2-1-3-6-15/h4,7-8,11,15,17-18,20H,1-3,5-6,9-10,12-14H2,(H2,22,24)/t17-,18+,20+
Reactome pathway
n/an/a 2.00E+3n/an/an/an/an/an/a
AstraZeneca Pharmaceuticals
Curated by ChEMBL
Assay Description
Inhibition of human ERG by electrophysiology assay
Bioorg Med Chem Lett 20: 5405-10 (2010)
Article DOI: 10.1016/j.bmcl.2010.07.112
BindingDB Entry DOI: 10.7270/Q2X92BHQ
Mu-type opioid receptor
(Homo sapiens (Human))
BDBM50325849
(3-((1R,3r,5S)-8-(cyclohexylmethyl)-8-azabicyclo[3....)
Show SMILES NC(=O)c1cccc(O[C@@H]2C[C@@H]3CC[C@H](C2)N3CC2CCCCC2)c1 |r,TLB:17:16:9.10.15:12.13|
Show InChI InChI=1S/C21H30N2O2/c22-21(24)16-7-4-8-19(11-16)25-20-12-17-9-10-18(13-20)23(17)14-15-5-2-1-3-6-15/h4,7-8,11,15,17-18,20H,1-3,5-6,9-10,12-14H2,(H2,22,24)/t17-,18+,20+
NCI pathway
Reactome pathway
n/an/a 1.83E+3n/an/an/an/an/an/a
AstraZeneca Pharmaceuticals
Curated by ChEMBL
Assay Description
Antagonist activity at human mu opioid receptor expressed in HEK cells assessed as inhibition of DAMGO-induced [35S]GTPgammaS binding
Bioorg Med Chem Lett 20: 5405-10 (2010)
Article DOI: 10.1016/j.bmcl.2010.07.112
BindingDB Entry DOI: 10.7270/Q2X92BHQ
Kappa-type opioid receptor
(Homo sapiens (Human))
BDBM50325849
(3-((1R,3r,5S)-8-(cyclohexylmethyl)-8-azabicyclo[3....)
Show SMILES NC(=O)c1cccc(O[C@@H]2C[C@@H]3CC[C@H](C2)N3CC2CCCCC2)c1 |r,TLB:17:16:9.10.15:12.13|
Show InChI InChI=1S/C21H30N2O2/c22-21(24)16-7-4-8-19(11-16)25-20-12-17-9-10-18(13-20)23(17)14-15-5-2-1-3-6-15/h4,7-8,11,15,17-18,20H,1-3,5-6,9-10,12-14H2,(H2,22,24)/t17-,18+,20+
Reactome pathway
n/an/a 204n/an/an/an/an/an/a
AstraZeneca Pharmaceuticals
Curated by ChEMBL
Assay Description
Antagonist activity at human kappa opioid receptor expressed in HEK cells assessed as inhibition of dynorphin A-induced [35S]GTPgammaS binding
Bioorg Med Chem Lett 20: 5405-10 (2010)
Article DOI: 10.1016/j.bmcl.2010.07.112
BindingDB Entry DOI: 10.7270/Q2X92BHQ