BDBM50325870 CHEMBL1224214::endo-4-((1R,5S)-8-benzyl-8-azabicyclo[3.2.1]octan-3-yloxy)benzamide
SMILES: NC(=O)c1ccc(O[C@@H]2C[C@@H]3CC[C@H](C2)N3Cc2ccccc2)cc1
InChI Key: InChIKey=MXQRIZAKRVYJHN-RUYXUALKSA-N
Data: 2 IC50
Activity Spreadsheet -- Enzyme Inhibition Constant Data from BindingDB
Found 2 hits for monomerid = 50325870
Trg + Lig
Ki
nM
ΔG°
kcal/mole
IC50
nM
Kd
nM
EC50/IC50
nM
koff
s-1
kon
M-1s-1
pHTemp
°C
Potassium voltage-gated channel subfamily H member 2
(Homo sapiens (Human))
BDBM50325870
(CHEMBL1224214 | endo-4-((1R,5S)-8-benzyl-8-azabicy...)
Show SMILES NC(=O)c1ccc(O[C@@H]2C[C@@H]3CC[C@H](C2)N3Cc2ccccc2)cc1 |r,TLB:16:15:14.8.9:12.11|
Show InChI InChI=1S/C21H24N2O2/c22-21(24)16-6-10-19(11-7-16)25-20-12-17-8-9-18(13-20)23(17)14-15-4-2-1-3-5-15/h1-7,10-11,17-18,20H,8-9,12-14H2,(H2,22,24)/t17-,18+,20+
Reactome pathway
n/an/a 680n/an/an/an/an/an/a
AstraZeneca Pharmaceuticals
Curated by ChEMBL
Assay Description
Inhibition of human ERG by electrophysiology assay
Bioorg Med Chem Lett 20: 5405-10 (2010)
Article DOI: 10.1016/j.bmcl.2010.07.112
BindingDB Entry DOI: 10.7270/Q2X92BHQ
Kappa-type opioid receptor
(Homo sapiens (Human))
BDBM50325870
(CHEMBL1224214 | endo-4-((1R,5S)-8-benzyl-8-azabicy...)
Show SMILES NC(=O)c1ccc(O[C@@H]2C[C@@H]3CC[C@H](C2)N3Cc2ccccc2)cc1 |r,TLB:16:15:14.8.9:12.11|
Show InChI InChI=1S/C21H24N2O2/c22-21(24)16-6-10-19(11-7-16)25-20-12-17-8-9-18(13-20)23(17)14-15-4-2-1-3-5-15/h1-7,10-11,17-18,20H,8-9,12-14H2,(H2,22,24)/t17-,18+,20+
Reactome pathway
n/an/a 1.07E+4n/an/an/an/an/an/a
AstraZeneca Pharmaceuticals
Curated by ChEMBL
Assay Description
Antagonist activity at human kappa opioid receptor expressed in HEK cells assessed as inhibition of dynorphin A-induced [35S]GTPgammaS binding
Bioorg Med Chem Lett 20: 5405-10 (2010)
Article DOI: 10.1016/j.bmcl.2010.07.112
BindingDB Entry DOI: 10.7270/Q2X92BHQ