BDBM50326090 (E)-2-(4-Bromobenzylthio)-3-(4-fluoro-3-nitrophenyl)-1-(4-(4-(2-hydroxy-ethyl)piperazine-1-carbonyl)phenyl)prop-2-en-1-one::CHEMBL1242391
SMILES: OCCN1CCN(CC1)C(=O)c1ccc(cc1)C(=O)C(\SCc1ccc(Br)cc1)=C/c1ccc(F)c(c1)[N+]([O-])=O
InChI Key: InChIKey=AATUFOXFWPLFGG-OVVQPSECSA-N
Data: 1 IC50
Activity Spreadsheet -- Enzyme Inhibition Constant Data from BindingDB
Found 1 hit for monomerid = 50326090
Trg + Lig
Ki
nM
ΔG°
kcal/mole
IC50
nM
Kd
nM
EC50/IC50
nM
koff
s-1
kon
M-1s-1
pHTemp
°C
Bcr-Abl
(Homo sapiens (Human))
BDBM50326090
((E)-2-(4-Bromobenzylthio)-3-(4-fluoro-3-nitropheny...)
Show SMILES OCCN1CCN(CC1)C(=O)c1ccc(cc1)C(=O)C(\SCc1ccc(Br)cc1)=C/c1ccc(F)c(c1)[N+]([O-])=O
Show InChI InChI=1S/C29H27BrFN3O5S/c30-24-8-1-20(2-9-24)19-40-27(18-21-3-10-25(31)26(17-21)34(38)39)28(36)22-4-6-23(7-5-22)29(37)33-13-11-32(12-14-33)15-16-35/h1-10,17-18,35H,11-16,19H2/b27-18+
NCI pathway
Reactome pathway
n/an/a 500n/an/an/an/an/an/a
Temple University School of Medicine
Curated by ChEMBL
Assay Description
Inhibition of BCR/ABL p210 autophosphorylation in human K562 cells after 2 hrs by Western blot analysis
Bioorg Med Chem 18: 2317-26 (2010)
Article DOI: 10.1016/j.bmc.2010.01.051
BindingDB Entry DOI: 10.7270/Q21Z44N8