BDBM50326233 CHEMBL1243011::N-{1-[3-(5-Fluoro-2-oxo-3,4-dihydro-2H-quinolin-1-yl)-propyl]-piperidin-4-yl}-2-phenyl-acetamide
SMILES: Fc1cccc2N(CCCN3CCC(CC3)NC(=O)Cc3ccccc3)C(=O)CCc12
InChI Key: InChIKey=FNUCNTBFNSAGSW-UHFFFAOYSA-N
Data: 1 EC50
Activity Spreadsheet -- Enzyme Inhibition Constant Data from BindingDB
Found 1 hit for monomerid = 50326233
Trg + Lig
Ki
nM
ΔG°
kcal/mole
IC50
nM
Kd
nM
EC50/IC50
nM
koff
s-1
kon
M-1s-1
pHTemp
°C
Muscarinic acetylcholine receptor M1
(Homo sapiens (Human))
BDBM50326233
(CHEMBL1243011 | N-{1-[3-(5-Fluoro-2-oxo-3,4-dihydr...)
Show SMILES Fc1cccc2N(CCCN3CCC(CC3)NC(=O)Cc3ccccc3)C(=O)CCc12
Show InChI InChI=1S/C25H30FN3O2/c26-22-8-4-9-23-21(22)10-11-25(31)29(23)15-5-14-28-16-12-20(13-17-28)27-24(30)18-19-6-2-1-3-7-19/h1-4,6-9,20H,5,10-18H2,(H,27,30)
n/an/an/an/a 150n/an/an/an/a
H. Lundbeck A/S
Curated by ChEMBL
Assay Description
Agonist activity at human muscarinic M1 receptor expressed in CHO-K1 cells assessed as increase of acetylcholine-induced calcium flux by FLIPR assay
J Med Chem 53: 6386-97 (2010)
Article DOI: 10.1021/jm100697g
BindingDB Entry DOI: 10.7270/Q2765G9K