BDBM50326290 2-(1H-Imidazol-4-yl)-N-methyl-3-(4-(trifluoromethyl)phenylthio)propane-1-amine::CHEMBL1243303
SMILES: CNCC(CSc1ccc(cc1)C(F)(F)F)c1cnc[nH]1
InChI Key: InChIKey=MJFULYPEKJAFJK-UHFFFAOYSA-N
Data: 1 KI  1 EC50
Activity Spreadsheet -- Enzyme Inhibition Constant Data from BindingDB
Found 2 hits for monomerid = 50326290
Trg + Lig
Ki
nM
ΔG°
kcal/mole
IC50
nM
Kd
nM
EC50/IC50
nM
koff
s-1
kon
M-1s-1
pHTemp
°C
Histamine H3 receptor
(Homo sapiens (Human))
BDBM50326290
(2-(1H-Imidazol-4-yl)-N-methyl-3-(4-(trifluoromethy...)
Show SMILES CNCC(CSc1ccc(cc1)C(F)(F)F)c1cnc[nH]1
Show InChI InChI=1S/C14H16F3N3S/c1-18-6-10(13-7-19-9-20-13)8-21-12-4-2-11(3-5-12)14(15,16)17/h2-5,7,9-10,18H,6,8H2,1H3,(H,19,20)
Reactome pathway
>1.00E+3n/an/an/an/an/an/an/an/a
Meiji Seika Kaisha, Ltd.
Curated by ChEMBL
Assay Description
Displacement of [3H]-(R)-alpha-methylhistamine from human histamine H3 receptor expressed in CHO cells by liquid scintillation counting
J Med Chem 53: 6445-56 (2010)
Article DOI: 10.1021/jm100643t
BindingDB Entry DOI: 10.7270/Q2QF8T3X
Histamine H3 receptor
(Homo sapiens (Human))
BDBM50326290
(2-(1H-Imidazol-4-yl)-N-methyl-3-(4-(trifluoromethy...)
Show SMILES CNCC(CSc1ccc(cc1)C(F)(F)F)c1cnc[nH]1
Show InChI InChI=1S/C14H16F3N3S/c1-18-6-10(13-7-19-9-20-13)8-21-12-4-2-11(3-5-12)14(15,16)17/h2-5,7,9-10,18H,6,8H2,1H3,(H,19,20)
Reactome pathway
n/an/an/an/a>1.00E+3n/an/an/an/a
Meiji Seika Kaisha, Ltd.
Curated by ChEMBL
Assay Description
Agonist activity at human histamine H3 receptor expressed in CHO cells assessed as [35S]GTPgammaS binding
J Med Chem 53: 6445-56 (2010)
Article DOI: 10.1021/jm100643t
BindingDB Entry DOI: 10.7270/Q2QF8T3X