BDBM50326296 2-((1H-imidazol-4-yl)methyl)pyridine::2-(3H-Imidazol-4-ylmethyl)-pyridine::CHEMBL81644
SMILES: C(c1cnc[nH]1)c1ccccn1
InChI Key: InChIKey=YSOIYRCVNZBHGT-UHFFFAOYSA-N
Data: 1 KI  1 EC50
Activity Spreadsheet -- Enzyme Inhibition Constant Data from BindingDB
Found 2 hits for monomerid = 50326296
Trg + Lig
Ki
nM
ΔG°
kcal/mole
IC50
nM
Kd
nM
EC50/IC50
nM
koff
s-1
kon
M-1s-1
pHTemp
°C
Histamine H3 receptor
(Homo sapiens (Human))
BDBM50326296
(2-((1H-imidazol-4-yl)methyl)pyridine | 2-(3H-Imida...)
Show SMILES C(c1cnc[nH]1)c1ccccn1
Show InChI InChI=1S/C9H9N3/c1-2-4-11-8(3-1)5-9-6-10-7-12-9/h1-4,6-7H,5H2,(H,10,12)
Reactome pathway
1.80E+3n/an/an/an/an/an/an/an/a
Meiji Seika Kaisha, Ltd.
Curated by ChEMBL
Assay Description
Displacement of [3H]-(R)-alpha-methylhistamine from human histamine H3 receptor expressed in CHO cells by liquid scintillation counting
J Med Chem 53: 6445-56 (2010)
Article DOI: 10.1021/jm100643t
BindingDB Entry DOI: 10.7270/Q2QF8T3X
Histamine H3 receptor
(Homo sapiens (Human))
BDBM50326296
(2-((1H-imidazol-4-yl)methyl)pyridine | 2-(3H-Imida...)
Show SMILES C(c1cnc[nH]1)c1ccccn1
Show InChI InChI=1S/C9H9N3/c1-2-4-11-8(3-1)5-9-6-10-7-12-9/h1-4,6-7H,5H2,(H,10,12)
Reactome pathway
n/an/an/an/a 1.30E+3n/an/an/an/a
Meiji Seika Kaisha, Ltd.
Curated by ChEMBL
Assay Description
Agonist activity at human histamine H3 receptor expressed in CHO cells assessed as [35S]GTPgammaS binding
J Med Chem 53: 6445-56 (2010)
Article DOI: 10.1021/jm100643t
BindingDB Entry DOI: 10.7270/Q2QF8T3X