BDBM50326660 (-)-N-Allyl-4,14-dimethoxymorphinan-6-one::CHEMBL610893
SMILES: COc1cccc2C[C@H]3N(CC=C)CC[C@@]4(CC(=O)CC[C@@]34OC)c12
InChI Key: InChIKey=PCHFIFRJLZPVPT-HMXCVIKNSA-N
Data: 3 KI  1 IC50
Activity Spreadsheet -- Enzyme Inhibition Constant Data from BindingDB
Found 4 hits for monomerid = 50326660
Trg + Lig
Ki
nM
ΔG°
kcal/mole
IC50
nM
Kd
nM
EC50/IC50
nM
koff
s-1
kon
M-1s-1
pHTemp
°C
Mu-type opioid receptor
(Rattus norvegicus (rat))
BDBM50326660
((-)-N-Allyl-4,14-dimethoxymorphinan-6-one | CHEMBL...)
Show SMILES COc1cccc2C[C@H]3N(CC=C)CC[C@@]4(CC(=O)CC[C@@]34OC)c12 |r|
Show InChI InChI=1S/C21H27NO3/c1-4-11-22-12-10-20-14-16(23)8-9-21(20,25-3)18(22)13-15-6-5-7-17(24-2)19(15)20/h4-7,18H,1,8-14H2,2-3H3/t18-,20-,21-/m1/s1
Reactome pathway
2n/an/an/an/an/an/an/an/a
University of Innsbruck and Center for Molecular Biosciences Innsbruck-CMBI
Curated by ChEMBL
Assay Description
Displacement of [3H]DAMGO from mu opioid receptor in rat brain membrane
Bioorg Med Chem 18: 5071-80 (2010)
Article DOI: 10.1016/j.bmc.2010.05.071
BindingDB Entry DOI: 10.7270/Q2XP75XQ
Opioid receptors; mu & delta
(Rattus norvegicus (rat))
BDBM50326660
((-)-N-Allyl-4,14-dimethoxymorphinan-6-one | CHEMBL...)
Show SMILES COc1cccc2C[C@H]3N(CC=C)CC[C@@]4(CC(=O)CC[C@@]34OC)c12 |r|
Show InChI InChI=1S/C21H27NO3/c1-4-11-22-12-10-20-14-16(23)8-9-21(20,25-3)18(22)13-15-6-5-7-17(24-2)19(15)20/h4-7,18H,1,8-14H2,2-3H3/t18-,20-,21-/m1/s1
Reactome pathway
210n/an/an/an/an/an/an/an/a
University of Innsbruck and Center for Molecular Biosciences Innsbruck-CMBI
Curated by ChEMBL
Assay Description
Displacement of [3H][Ile5,6]deltorphin2 from delta opioid receptor in rat brain membrane
Bioorg Med Chem 18: 5071-80 (2010)
Article DOI: 10.1016/j.bmc.2010.05.071
BindingDB Entry DOI: 10.7270/Q2XP75XQ
Kappa-type opioid receptor
(Cavia porcellus (domestic guinea pig))
BDBM50326660
((-)-N-Allyl-4,14-dimethoxymorphinan-6-one | CHEMBL...)
Show SMILES COc1cccc2C[C@H]3N(CC=C)CC[C@@]4(CC(=O)CC[C@@]34OC)c12 |r|
Show InChI InChI=1S/C21H27NO3/c1-4-11-22-12-10-20-14-16(23)8-9-21(20,25-3)18(22)13-15-6-5-7-17(24-2)19(15)20/h4-7,18H,1,8-14H2,2-3H3/t18-,20-,21-/m1/s1
567n/an/an/an/an/an/an/an/a
University of Innsbruck and Center for Molecular Biosciences Innsbruck-CMBI
Curated by ChEMBL
Assay Description
Displacement of [3H]U69593 from kappa opioid receptor in guinea pig brain membrane
Bioorg Med Chem 18: 5071-80 (2010)
Article DOI: 10.1016/j.bmc.2010.05.071
BindingDB Entry DOI: 10.7270/Q2XP75XQ
Acetylcholinesterase
(Electrophorus electricus (Electric eel))
BDBM50326660
((-)-N-Allyl-4,14-dimethoxymorphinan-6-one | CHEMBL...)
Show SMILES COc1cccc2C[C@H]3N(CC=C)CC[C@@]4(CC(=O)CC[C@@]34OC)c12 |r|
Show InChI InChI=1S/C21H27NO3/c1-4-11-22-12-10-20-14-16(23)8-9-21(20,25-3)18(22)13-15-6-5-7-17(24-2)19(15)20/h4-7,18H,1,8-14H2,2-3H3/t18-,20-,21-/m1/s1
n/an/a 8.19E+4n/an/an/an/an/an/a
University of Innsbruck and Center for Molecular Biosciences Innsbruck-CMBI
Curated by ChEMBL
Assay Description
Inhibition of electric eel AChE by Ellman's method
Bioorg Med Chem 18: 5071-80 (2010)
Article DOI: 10.1016/j.bmc.2010.05.071
BindingDB Entry DOI: 10.7270/Q2XP75XQ