BDBM50326950 2-(4-((1H-pyrrolo[2,3-c]pyridin-2-yl)methyl)-5,5,5-trifluoro-4-hydroxy-2-methylpentan-2-yl)-4-(pyridin-3-yl)phenol::CHEMBL1254344
SMILES: CC(C)(CC(O)(Cc1cc2ccncc2[nH]1)C(F)(F)F)c1cc(ccc1O)-c1cccnc1
InChI Key: InChIKey=LIYOMQNHCSVUSQ-UHFFFAOYSA-N
Data: 5 IC50
Activity Spreadsheet -- Enzyme Inhibition Constant Data from BindingDB
Found 5 hits for monomerid = 50326950
Trg + Lig
Ki
nM
ΔG°
kcal/mole
IC50
nM
Kd
nM
EC50/IC50
nM
koff
s-1
kon
M-1s-1
pHTemp
°C
Glucocorticoid receptor
(Homo sapiens (Human))
BDBM50326950
(2-(4-((1H-pyrrolo[2,3-c]pyridin-2-yl)methyl)-5,5,5...)
Show SMILES CC(C)(CC(O)(Cc1cc2ccncc2[nH]1)C(F)(F)F)c1cc(ccc1O)-c1cccnc1
Show InChI InChI=1S/C25H24F3N3O2/c1-23(2,20-11-16(5-6-22(20)32)18-4-3-8-29-13-18)15-24(33,25(26,27)28)12-19-10-17-7-9-30-14-21(17)31-19/h3-11,13-14,31-33H,12,15H2,1-2H3
n/an/a 23n/an/an/an/an/an/a
Boehringer-Ingelheim Pharmaceuticals Inc.
Curated by ChEMBL
Assay Description
Transrepression activity at glucocorticoid receptor in HFF assessed as inhibition of IL-1-induced IL-6 production after 18 to 24 hrs by ELISA
J Med Chem 53: 6681-98 (2010)
Article DOI: 10.1021/jm100751q
BindingDB Entry DOI: 10.7270/Q2571D0X
Glucocorticoid receptor
(Homo sapiens (Human))
BDBM50326950
(2-(4-((1H-pyrrolo[2,3-c]pyridin-2-yl)methyl)-5,5,5...)
Show SMILES CC(C)(CC(O)(Cc1cc2ccncc2[nH]1)C(F)(F)F)c1cc(ccc1O)-c1cccnc1
Show InChI InChI=1S/C25H24F3N3O2/c1-23(2,20-11-16(5-6-22(20)32)18-4-3-8-29-13-18)15-24(33,25(26,27)28)12-19-10-17-7-9-30-14-21(17)31-19/h3-11,13-14,31-33H,12,15H2,1-2H3
n/an/a 6.60n/an/an/an/an/an/a
Boehringer-Ingelheim Pharmaceuticals Inc.
Curated by ChEMBL
Assay Description
Binding affinity to glucocorticoid receptor expressed in baculovirus-infected insect cells using tetramethylrhodamine labeled Dexamethasone by fluore...
J Med Chem 53: 6681-98 (2010)
Article DOI: 10.1021/jm100751q
BindingDB Entry DOI: 10.7270/Q2571D0X
Glucocorticoid receptor
(Homo sapiens (Human))
BDBM50326950
(2-(4-((1H-pyrrolo[2,3-c]pyridin-2-yl)methyl)-5,5,5...)
Show SMILES CC(C)(CC(O)(Cc1cc2ccncc2[nH]1)C(F)(F)F)c1cc(ccc1O)-c1cccnc1
Show InChI InChI=1S/C25H24F3N3O2/c1-23(2,20-11-16(5-6-22(20)32)18-4-3-8-29-13-18)15-24(33,25(26,27)28)12-19-10-17-7-9-30-14-21(17)31-19/h3-11,13-14,31-33H,12,15H2,1-2H3
n/an/a>2.00E+3n/an/an/an/an/an/a
Boehringer-Ingelheim Pharmaceuticals Inc.
Curated by ChEMBL
Assay Description
Transactivation activity at glucocorticoid receptor in human HeLa cells transfected with luciferase gene linked to MMTV promoter by luciferase assay
J Med Chem 53: 6681-98 (2010)
Article DOI: 10.1021/jm100751q
BindingDB Entry DOI: 10.7270/Q2571D0X
Progesterone receptor
(Homo sapiens (Human))
BDBM50326950
(2-(4-((1H-pyrrolo[2,3-c]pyridin-2-yl)methyl)-5,5,5...)
Show SMILES CC(C)(CC(O)(Cc1cc2ccncc2[nH]1)C(F)(F)F)c1cc(ccc1O)-c1cccnc1
Show InChI InChI=1S/C25H24F3N3O2/c1-23(2,20-11-16(5-6-22(20)32)18-4-3-8-29-13-18)15-24(33,25(26,27)28)12-19-10-17-7-9-30-14-21(17)31-19/h3-11,13-14,31-33H,12,15H2,1-2H3
n/an/a>2.00E+3n/an/an/an/an/an/a
Boehringer-Ingelheim Pharmaceuticals Inc.
Curated by ChEMBL
Assay Description
Binding affinity to progesterone receptor expressed in baculovirus-infected insect cells using tetramethylrhodamine labeled RU-486 by fluorescence po...
J Med Chem 53: 6681-98 (2010)
Article DOI: 10.1021/jm100751q
BindingDB Entry DOI: 10.7270/Q2571D0X
Mineralocorticoid receptor
(Homo sapiens (Human))
BDBM50326950
(2-(4-((1H-pyrrolo[2,3-c]pyridin-2-yl)methyl)-5,5,5...)
Show SMILES CC(C)(CC(O)(Cc1cc2ccncc2[nH]1)C(F)(F)F)c1cc(ccc1O)-c1cccnc1
Show InChI InChI=1S/C25H24F3N3O2/c1-23(2,20-11-16(5-6-22(20)32)18-4-3-8-29-13-18)15-24(33,25(26,27)28)12-19-10-17-7-9-30-14-21(17)31-19/h3-11,13-14,31-33H,12,15H2,1-2H3
n/an/a 230n/an/an/an/an/an/a
Boehringer-Ingelheim Pharmaceuticals Inc.
Curated by ChEMBL
Assay Description
Binding affinity to mineralocorticoid receptor expressed in baculovirus-infected insect cells using tetramethylrhodamine labeled Dexamethasone by flu...
J Med Chem 53: 6681-98 (2010)
Article DOI: 10.1021/jm100751q
BindingDB Entry DOI: 10.7270/Q2571D0X