BDBM50327051 CHEMBL1255093::N-{4-[(5-Methyl-5H-pyrrolo[3,2-d]pyrimidin-4-yl)oxy]-phenyl}benzamide
SMILES: Cn1ccc2ncnc(Oc3ccc(NC(=O)c4ccccc4)cc3)c12
InChI Key: InChIKey=NSQYNEMRLNGHTF-UHFFFAOYSA-N
Data: 1 IC50
Activity Spreadsheet -- Enzyme Inhibition Constant Data from BindingDB
Found 1 hit for monomerid = 50327051
Trg + Lig
Ki
nM
ΔG°
kcal/mole
IC50
nM
Kd
nM
EC50/IC50
nM
koff
s-1
kon
M-1s-1
pHTemp
°C
Vascular endothelial growth factor receptor 2
(Homo sapiens (Human))
BDBM50327051
(CHEMBL1255093 | N-{4-[(5-Methyl-5H-pyrrolo[3,2-d]p...)
Show SMILES Cn1ccc2ncnc(Oc3ccc(NC(=O)c4ccccc4)cc3)c12
Show InChI InChI=1S/C20H16N4O2/c1-24-12-11-17-18(24)20(22-13-21-17)26-16-9-7-15(8-10-16)23-19(25)14-5-3-2-4-6-14/h2-13H,1H3,(H,23,25)
NCI pathway
Reactome pathway
n/an/a 9.40E+3n/an/an/an/an/an/a
Takeda Pharmaceutical Co., Ltd
Curated by ChEMBL
Assay Description
Inhibition of human VEGFR2
Bioorg Med Chem 18: 7260-73 (2010)
Article DOI: 10.1016/j.bmc.2010.08.017
BindingDB Entry DOI: 10.7270/Q2NC61DC