BDBM50327141 (R)-methyl 2-(4-nitrophenyl)-2-((R)-piperidin-2-yl)acetate::CHEMBL1254439
SMILES: COC(=O)[C@@H]([C@H]1CCCCN1)c1ccc(cc1)[N+]([O-])=O
InChI Key: InChIKey=BLBRFFAJTBEQKE-CHWSQXEVSA-N
Data: 1 KI  1 IC50
Activity Spreadsheet -- Enzyme Inhibition Constant Data from BindingDB
Found 2 hits for monomerid = 50327141
Trg + Lig
Ki
nM
ΔG°
kcal/mole
IC50
nM
Kd
nM
EC50/IC50
nM
koff
s-1
kon
M-1s-1
pHTemp
°C
Sodium-dependent dopamine transporter
(Homo sapiens (Human))
BDBM50327141
((R)-methyl 2-(4-nitrophenyl)-2-((R)-piperidin-2-yl...)
Show SMILES COC(=O)[C@@H]([C@H]1CCCCN1)c1ccc(cc1)[N+]([O-])=O |r|
Show InChI InChI=1S/C14H18N2O4/c1-20-14(17)13(12-4-2-3-9-15-12)10-5-7-11(8-6-10)16(18)19/h5-8,12-13,15H,2-4,9H2,1H3/t12-,13-/m1/s1
NCI pathway
Reactome pathway
77n/an/an/an/an/an/an/an/a
TBA
Curated by ChEMBL
Assay Description
Displacement of [3H]WIN-35,428 from human DAT expressed in mouse N2A cells after 15 mins by liquid scintillation counting
ACS Med Chem Lett 3: 378-382 (2012)
Article DOI: 10.1021/ml3000098
BindingDB Entry DOI: 10.7270/Q2FX7BHG
Sodium-dependent dopamine transporter
(Rattus norvegicus (rat))
BDBM50327141
((R)-methyl 2-(4-nitrophenyl)-2-((R)-piperidin-2-yl...)
Show SMILES COC(=O)[C@@H]([C@H]1CCCCN1)c1ccc(cc1)[N+]([O-])=O |r|
Show InChI InChI=1S/C14H18N2O4/c1-20-14(17)13(12-4-2-3-9-15-12)10-5-7-11(8-6-10)16(18)19/h5-8,12-13,15H,2-4,9H2,1H3/t12-,13-/m1/s1
Reactome pathway
n/an/a 494n/an/an/an/an/an/a
Institute of Technology
Curated by ChEMBL
Assay Description
Displacement of [3H]WIN 35428 from Sprague-Dawley rat striatal tissue after 2 hrs by liquid scintillation counting
Bioorg Med Chem 18: 7221-38 (2010)
Article DOI: 10.1016/j.bmc.2010.08.034
BindingDB Entry DOI: 10.7270/Q24F1QZZ