BDBM50327187 1-{5-tert-Butyl-2-[3-(1,1,3-trioxo-1lambda*6*-[1,2,5]thiadiazolidin-2-ylmethyl)-phenyl]-2H-pyrazol-3-yl}-3-(4-chloro-phenyl)-urea::1-{5-tert-Butyl-2-[3-(1,1,3-trioxo-1lambda-6-[1,2,5]thiadiazolidin-2-ylmethyl)-phenyl]-2H-pyrazol-3-yl}-3-(4-chloro-phenyl)-urea::CHEMBL1257218
SMILES: CC(C)(C)c1cc(NC(=O)Nc2ccc(Cl)cc2)n(n1)-c1cccc(CN2C(O)=CNS2(=O)=O)c1
InChI Key: InChIKey=PRDFENXCUNQHNA-UHFFFAOYSA-N
Data: 1 KI  1 IC50  1 Kd
Activity Spreadsheet -- Enzyme Inhibition Constant Data from BindingDB
Found 3 hits for monomerid = 50327187
Trg + Lig
Ki
nM
ΔG°
kcal/mole
IC50
nM
Kd
nM
EC50/IC50
nM
koff
s-1
kon
M-1s-1
pHTemp
°C
Mitogen-activated protein kinase 14
(Homo sapiens (Human))
BDBM50327187
(1-{5-tert-Butyl-2-[3-(1,1,3-trioxo-1lambda*6*-[1,2...)
Show SMILES CC(C)(C)c1cc(NC(=O)Nc2ccc(Cl)cc2)n(n1)-c1cccc(CN2C(O)=CNS2(=O)=O)c1 |c:30|
Show InChI InChI=1S/C23H25ClN6O4S/c1-23(2,3)19-12-20(27-22(32)26-17-9-7-16(24)8-10-17)30(28-19)18-6-4-5-15(11-18)14-29-21(31)13-25-35(29,33)34/h4-13,25,31H,14H2,1-3H3,(H2,26,27,32)
NCI pathway
Reactome pathway
99n/an/an/an/an/an/an/an/a
Abbott Laboratories
Curated by ChEMBL
Assay Description
Binding affinity to full-length GST-tagged p38alpha after 2.5 hrs by TR-FRET competition binding assay
Bioorg Med Chem Lett 20: 5787-92 (2010)
Article DOI: 10.1016/j.bmcl.2010.04.097
BindingDB Entry DOI: 10.7270/Q2MC907J
Mitogen-activated protein kinase 14
(Homo sapiens (Human))
BDBM50327187
(1-{5-tert-Butyl-2-[3-(1,1,3-trioxo-1lambda*6*-[1,2...)
Show SMILES CC(C)(C)c1cc(NC(=O)Nc2ccc(Cl)cc2)n(n1)-c1cccc(CN2C(O)=CNS2(=O)=O)c1 |c:30|
Show InChI InChI=1S/C23H25ClN6O4S/c1-23(2,3)19-12-20(27-22(32)26-17-9-7-16(24)8-10-17)30(28-19)18-6-4-5-15(11-18)14-29-21(31)13-25-35(29,33)34/h4-13,25,31H,14H2,1-3H3,(H2,26,27,32)
NCI pathway
Reactome pathway
n/an/a 57n/an/an/an/an/an/a
Deciphera Pharmaceuticals LLC
Curated by ChEMBL
Assay Description
Inhibition of p38alpha by fluoroprobe binding assay
Bioorg Med Chem Lett 20: 5793-8 (2010)
Article DOI: 10.1016/j.bmcl.2010.07.134
BindingDB Entry DOI: 10.7270/Q2XD11WK
Mitogen-activated protein kinase 14
(Homo sapiens (Human))
BDBM50327187
(1-{5-tert-Butyl-2-[3-(1,1,3-trioxo-1lambda*6*-[1,2...)
Show SMILES CC(C)(C)c1cc(NC(=O)Nc2ccc(Cl)cc2)n(n1)-c1cccc(CN2C(O)=CNS2(=O)=O)c1 |c:30|
Show InChI InChI=1S/C23H25ClN6O4S/c1-23(2,3)19-12-20(27-22(32)26-17-9-7-16(24)8-10-17)30(28-19)18-6-4-5-15(11-18)14-29-21(31)13-25-35(29,33)34/h4-13,25,31H,14H2,1-3H3,(H2,26,27,32)
NCI pathway
Reactome pathway
n/an/an/a 564n/an/an/an/an/a
Abbott Laboratories
Curated by ChEMBL
Assay Description
Binding affinity to full-length GST-tagged p38alpha by surface plasmon resonance assay
Bioorg Med Chem Lett 20: 5787-92 (2010)
Article DOI: 10.1016/j.bmcl.2010.04.097
BindingDB Entry DOI: 10.7270/Q2MC907J