BDBM50327378 (1S,2R,5aS,7R,8aR,8bS)-7-(benzylamino)-2-((R)-1-(3,5-bis(trifluoromethyl)phenyl)ethoxy)-1-(4-fluorophenyl)octahydrocyclopenta[a]pyrrolizin-5(5aH)-one::CHEMBL1256589
SMILES: C[C@@H](O[C@H]1CN2[C@@H]([C@@H]3C[C@H](C[C@@H]3C2=O)NCc2ccccc2)[C@@H]1c1ccc(F)cc1)c1cc(cc(c1)C(F)(F)F)C(F)(F)F
InChI Key: InChIKey=QTKOZNOELLHMIX-JJEANDOOSA-N
Data: 3 IC50
Activity Spreadsheet -- Enzyme Inhibition Constant Data from BindingDB
Found 3 hits for monomerid = 50327378
Trg + Lig
Ki
nM
ΔG°
kcal/mole
IC50
nM
Kd
nM
EC50/IC50
nM
koff
s-1
kon
M-1s-1
pHTemp
°C
Neurokinin 1 receptor
(Homo sapiens (Human))
BDBM50327378
((1S,2R,5aS,7R,8aR,8bS)-7-(benzylamino)-2-((R)-1-(3...)
Show SMILES C[C@@H](O[C@H]1CN2[C@@H]([C@@H]3C[C@H](C[C@@H]3C2=O)NCc2ccccc2)[C@@H]1c1ccc(F)cc1)c1cc(cc(c1)C(F)(F)F)C(F)(F)F |r|
Show InChI InChI=1S/C33H31F7N2O2/c1-18(21-11-22(32(35,36)37)13-23(12-21)33(38,39)40)44-28-17-42-30(29(28)20-7-9-24(34)10-8-20)26-14-25(15-27(26)31(42)43)41-16-19-5-3-2-4-6-19/h2-13,18,25-30,41H,14-17H2,1H3/t18-,25-,26-,27+,28+,29-,30+/m1/s1
Reactome pathway
n/an/a 1.30n/an/an/an/an/an/a
Merck Research Laboratories
Curated by ChEMBL
Assay Description
Displacement of [125I]substance P from human NK1 receptor expressed in CHO cells in presence of 50% human serum
Bioorg Med Chem Lett 20: 5925-32 (2010)
Article DOI: 10.1016/j.bmcl.2010.07.058
BindingDB Entry DOI: 10.7270/Q2668DFC
Pregnane X receptor
(Homo sapiens (Human))
BDBM50327378
((1S,2R,5aS,7R,8aR,8bS)-7-(benzylamino)-2-((R)-1-(3...)
Show SMILES C[C@@H](O[C@H]1CN2[C@@H]([C@@H]3C[C@H](C[C@@H]3C2=O)NCc2ccccc2)[C@@H]1c1ccc(F)cc1)c1cc(cc(c1)C(F)(F)F)C(F)(F)F |r|
Show InChI InChI=1S/C33H31F7N2O2/c1-18(21-11-22(32(35,36)37)13-23(12-21)33(38,39)40)44-28-17-42-30(29(28)20-7-9-24(34)10-8-20)26-14-25(15-27(26)31(42)43)41-16-19-5-3-2-4-6-19/h2-13,18,25-30,41H,14-17H2,1H3/t18-,25-,26-,27+,28+,29-,30+/m1/s1
n/an/a>2.50E+4n/an/an/an/an/an/a
Merck Research Laboratories
Curated by ChEMBL
Assay Description
Inhibition of human PXR induction
Bioorg Med Chem Lett 20: 5925-32 (2010)
Article DOI: 10.1016/j.bmcl.2010.07.058
BindingDB Entry DOI: 10.7270/Q2668DFC
Neurokinin 1 receptor
(Homo sapiens (Human))
BDBM50327378
((1S,2R,5aS,7R,8aR,8bS)-7-(benzylamino)-2-((R)-1-(3...)
Show SMILES C[C@@H](O[C@H]1CN2[C@@H]([C@@H]3C[C@H](C[C@@H]3C2=O)NCc2ccccc2)[C@@H]1c1ccc(F)cc1)c1cc(cc(c1)C(F)(F)F)C(F)(F)F |r|
Show InChI InChI=1S/C33H31F7N2O2/c1-18(21-11-22(32(35,36)37)13-23(12-21)33(38,39)40)44-28-17-42-30(29(28)20-7-9-24(34)10-8-20)26-14-25(15-27(26)31(42)43)41-16-19-5-3-2-4-6-19/h2-13,18,25-30,41H,14-17H2,1H3/t18-,25-,26-,27+,28+,29-,30+/m1/s1
Reactome pathway
n/an/a 0.140n/an/an/an/an/an/a
Merck Research Laboratories
Curated by ChEMBL
Assay Description
Displacement of [125I]substance P from human NK1 receptor expressed in CHO cells
Bioorg Med Chem Lett 20: 5925-32 (2010)
Article DOI: 10.1016/j.bmcl.2010.07.058
BindingDB Entry DOI: 10.7270/Q2668DFC