BDBM50327529 2-(4-bromophenyl)-N-((7-methoxy-2-(pyridin-3-yloxy)quinolin-3-yl)methyl)ethanamine::CHEMBL1258877
SMILES: COc1ccc2cc(CNCCc3ccc(Br)cc3)c(Oc3cccnc3)nc2c1
InChI Key: InChIKey=FDAIKHFUTBLWCS-UHFFFAOYSA-N
Data: 2 IC50
Activity Spreadsheet -- Enzyme Inhibition Constant Data from BindingDB
Found 2 hits for monomerid = 50327529
Trg + Lig
Ki
nM
ΔG°
kcal/mole
IC50
nM
Kd
nM
EC50/IC50
nM
koff
s-1
kon
M-1s-1
pHTemp
°C
G-protein coupled bile acid receptor 1
(Mus musculus)
BDBM50327529
(2-(4-bromophenyl)-N-((7-methoxy-2-(pyridin-3-yloxy...)
Show SMILES COc1ccc2cc(CNCCc3ccc(Br)cc3)c(Oc3cccnc3)nc2c1
Show InChI InChI=1S/C24H22BrN3O2/c1-29-21-9-6-18-13-19(15-27-12-10-17-4-7-20(25)8-5-17)24(28-23(18)14-21)30-22-3-2-11-26-16-22/h2-9,11,13-14,16,27H,10,12,15H2,1H3
Reactome pathway
n/an/a>1.00E+4n/an/an/an/an/an/a
Kalypsys, Inc.
Curated by ChEMBL
Assay Description
Agonist activity at mouse TGR5 receptor expressed in HEK293 cells assessed as intracellular cAMP level
Bioorg Med Chem Lett 20: 5718-21 (2010)
Article DOI: 10.1016/j.bmcl.2010.08.014
BindingDB Entry DOI: 10.7270/Q2N87B1H
G-protein coupled bile acid receptor 1
(Homo sapiens (Human))
BDBM50327529
(2-(4-bromophenyl)-N-((7-methoxy-2-(pyridin-3-yloxy...)
Show SMILES COc1ccc2cc(CNCCc3ccc(Br)cc3)c(Oc3cccnc3)nc2c1
Show InChI InChI=1S/C24H22BrN3O2/c1-29-21-9-6-18-13-19(15-27-12-10-17-4-7-20(25)8-5-17)24(28-23(18)14-21)30-22-3-2-11-26-16-22/h2-9,11,13-14,16,27H,10,12,15H2,1H3
Reactome pathway
n/an/a>1.00E+4n/an/an/an/an/an/a
Kalypsys, Inc.
Curated by ChEMBL
Assay Description
Agonist activity at human TGR5 receptor expressed in HEK293 cells assessed as intracellular cAMP level
Bioorg Med Chem Lett 20: 5718-21 (2010)
Article DOI: 10.1016/j.bmcl.2010.08.014
BindingDB Entry DOI: 10.7270/Q2N87B1H