BDBM50328198 2-(4-(4-(Trifluoromethoxy)phenylamino)-1H-pyrazolo-[3,4-d]pyrimidin-1-yl)ethanol::CHEMBL1258010::US9670214, TABLE 10.7
SMILES: OCCn1ncc2c(Nc3ccc(OC(F)(F)F)cc3)ncnc12
InChI Key: InChIKey=QQDDFQKWZHOVDY-UHFFFAOYSA-N
Data: 2 IC50  1 EC50
Activity Spreadsheet -- Enzyme Inhibition Constant Data from BindingDB
Found 3 hits for monomerid = 50328198
Trg + Lig
Ki
nM
ΔG°
kcal/mole
IC50
nM
Kd
nM
EC50/IC50
nM
koff
s-1
kon
M-1s-1
pHTemp
°C
Bcr-Abl
(Homo sapiens (Human))
BDBM50328198
(2-(4-(4-(Trifluoromethoxy)phenylamino)-1H-pyrazolo...)
Show SMILES OCCn1ncc2c(Nc3ccc(OC(F)(F)F)cc3)ncnc12
Show InChI InChI=1S/C14H12F3N5O2/c15-14(16,17)24-10-3-1-9(2-4-10)21-12-11-7-20-22(5-6-23)13(11)19-8-18-12/h1-4,7-8,23H,5-6H2,(H,18,19,21)
NCI pathway
Reactome pathway
n/an/an/an/a 250n/an/an/an/a
Harvard Medical School
Curated by ChEMBL
Assay Description
Inhibition of Bcr-Abl in mouse BA/F3 cells
J Med Chem 53: 6934-46 (2010)
Article DOI: 10.1021/jm100555f
BindingDB Entry DOI: 10.7270/Q2DJ5FTW
BCR/ABL fusion protein (T351I)
(Homo sapiens (Human))
BDBM50328198
(2-(4-(4-(Trifluoromethoxy)phenylamino)-1H-pyrazolo...)
Show SMILES OCCn1ncc2c(Nc3ccc(OC(F)(F)F)cc3)ncnc12
Show InChI InChI=1S/C14H12F3N5O2/c15-14(16,17)24-10-3-1-9(2-4-10)21-12-11-7-20-22(5-6-23)13(11)19-8-18-12/h1-4,7-8,23H,5-6H2,(H,18,19,21)
US Patent
n/an/a 4.20E+3n/an/an/an/a7.5n/a
DANA-FARBER CANCER INSTITUTE, INC.; THE SCRIPPS RESEARCH INSTITUTE
US Patent
Assay Description
In vitro kinase assays were carried out by using recombinant murine c-abl containing SH3, SH2 and kinase domains (residues 46-531) and full length im...
US Patent US9670214 (2017)
BindingDB Entry DOI: 10.7270/Q2000086
BCR/ABL fusion protein isoform X3
(Homo sapiens (Human))
BDBM50328198
(2-(4-(4-(Trifluoromethoxy)phenylamino)-1H-pyrazolo...)
Show SMILES OCCn1ncc2c(Nc3ccc(OC(F)(F)F)cc3)ncnc12
Show InChI InChI=1S/C14H12F3N5O2/c15-14(16,17)24-10-3-1-9(2-4-10)21-12-11-7-20-22(5-6-23)13(11)19-8-18-12/h1-4,7-8,23H,5-6H2,(H,18,19,21)
US Patent
n/an/a 254n/an/an/an/a7.5n/a
DANA-FARBER CANCER INSTITUTE, INC.; THE SCRIPPS RESEARCH INSTITUTE
US Patent
Assay Description
In vitro kinase assays were carried out by using recombinant murine c-abl containing SH3, SH2 and kinase domains (residues 46-531) and full length im...
US Patent US9670214 (2017)
BindingDB Entry DOI: 10.7270/Q2000086