BDBM50328221 2-(2-(4-(4-aminophenyl)piperazin-1-yl)thiazol-5-yl)-1,1,1,3,3,3-hexafluoropropan-2-ol::CHEMBL1258591
SMILES: Nc1ccc(cc1)N1CCN(CC1)c1ncc(s1)C(O)(C(F)(F)F)C(F)(F)F
InChI Key: InChIKey=DVDWMIOVEWMQFM-UHFFFAOYSA-N
Data: 1 IC50
Activity Spreadsheet -- Enzyme Inhibition Constant Data from BindingDB
Found 1 hit for monomerid = 50328221
Trg + Lig
Ki
nM
ΔG°
kcal/mole
IC50
nM
Kd
nM
EC50/IC50
nM
koff
s-1
kon
M-1s-1
pHTemp
°C
Malonyl-CoA decarboxylase
(Homo sapiens (Human))
BDBM50328221
(2-(2-(4-(4-aminophenyl)piperazin-1-yl)thiazol-5-yl...)
Show SMILES Nc1ccc(cc1)N1CCN(CC1)c1ncc(s1)C(O)(C(F)(F)F)C(F)(F)F
Show InChI InChI=1S/C16H16F6N4OS/c17-15(18,19)14(27,16(20,21)22)12-9-24-13(28-12)26-7-5-25(6-8-26)11-3-1-10(23)2-4-11/h1-4,9,27H,5-8,23H2
Reactome pathway
n/an/a 2.70n/an/an/an/an/an/a
Merck Research Laboratories
Curated by ChEMBL
Assay Description
Inhibition of human MCD
Bioorg Med Chem Lett 20: 6088-92 (2010)
Article DOI: 10.1016/j.bmcl.2010.08.047
BindingDB Entry DOI: 10.7270/Q2542NTX