BDBM50328246 3-(4-carbamoyl-1-(5-(1,1,1,3,3,3-hexafluoro-2-hydroxypropan-2-yl)thiazol-2-yl)piperidin-4-yl)benzoic acid::CHEMBL1258253
SMILES: NC(=O)C1(CCN(CC1)c1ncc(s1)C(O)(C(F)(F)F)C(F)(F)F)c1cccc(c1)C(O)=O
InChI Key: InChIKey=WNFAQVLTRONMFD-UHFFFAOYSA-N
Data: 1 IC50  1 EC50
Activity Spreadsheet -- Enzyme Inhibition Constant Data from BindingDB
Found 2 hits for monomerid = 50328246
Trg + Lig
Ki
nM
ΔG°
kcal/mole
IC50
nM
Kd
nM
EC50/IC50
nM
koff
s-1
kon
M-1s-1
pHTemp
°C
Malonyl-CoA decarboxylase, mitochondrial
(Mus musculus)
BDBM50328246
(3-(4-carbamoyl-1-(5-(1,1,1,3,3,3-hexafluoro-2-hydr...)
Show SMILES NC(=O)C1(CCN(CC1)c1ncc(s1)C(O)(C(F)(F)F)C(F)(F)F)c1cccc(c1)C(O)=O
Show InChI InChI=1S/C19H17F6N3O4S/c20-18(21,22)17(32,19(23,24)25)12-9-27-15(33-12)28-6-4-16(5-7-28,14(26)31)11-3-1-2-10(8-11)13(29)30/h1-3,8-9,32H,4-7H2,(H2,26,31)(H,29,30)
Reactome pathway
n/an/an/an/a 150n/an/an/an/a
Merck Research Laboratories
Curated by ChEMBL
Assay Description
Inhibition of MCD in mouse hepatocytes by whole cell assay
Bioorg Med Chem Lett 20: 6088-92 (2010)
Article DOI: 10.1016/j.bmcl.2010.08.047
BindingDB Entry DOI: 10.7270/Q2542NTX
Malonyl-CoA decarboxylase
(Homo sapiens (Human))
BDBM50328246
(3-(4-carbamoyl-1-(5-(1,1,1,3,3,3-hexafluoro-2-hydr...)
Show SMILES NC(=O)C1(CCN(CC1)c1ncc(s1)C(O)(C(F)(F)F)C(F)(F)F)c1cccc(c1)C(O)=O
Show InChI InChI=1S/C19H17F6N3O4S/c20-18(21,22)17(32,19(23,24)25)12-9-27-15(33-12)28-6-4-16(5-7-28,14(26)31)11-3-1-2-10(8-11)13(29)30/h1-3,8-9,32H,4-7H2,(H2,26,31)(H,29,30)
Reactome pathway
n/an/a 0.5n/an/an/an/an/an/a
Merck Research Laboratories
Curated by ChEMBL
Assay Description
Inhibition of human MCD
Bioorg Med Chem Lett 20: 6088-92 (2010)
Article DOI: 10.1016/j.bmcl.2010.08.047
BindingDB Entry DOI: 10.7270/Q2542NTX