BDBM50328248 1-(5-(1,1,1,3,3,3-hexafluoro-2-hydroxypropan-2-yl)thiazol-2-yl)-N-(methylsulfonyl)-4-phenylpiperidine-4-carboxamide::CHEMBL1258367
SMILES: CS(=O)(=O)NC(=O)C1(CCN(CC1)c1ncc(s1)C(O)(C(F)(F)F)C(F)(F)F)c1ccccc1
InChI Key: InChIKey=PISWOFOEBOEMFE-UHFFFAOYSA-N
Data: 1 IC50  1 EC50
Activity Spreadsheet -- Enzyme Inhibition Constant Data from BindingDB
Found 2 hits for monomerid = 50328248
Trg + Lig
Ki
nM
ΔG°
kcal/mole
IC50
nM
Kd
nM
EC50/IC50
nM
koff
s-1
kon
M-1s-1
pHTemp
°C
Malonyl-CoA decarboxylase, mitochondrial
(Mus musculus)
BDBM50328248
(1-(5-(1,1,1,3,3,3-hexafluoro-2-hydroxypropan-2-yl)...)
Show SMILES CS(=O)(=O)NC(=O)C1(CCN(CC1)c1ncc(s1)C(O)(C(F)(F)F)C(F)(F)F)c1ccccc1
Show InChI InChI=1S/C19H19F6N3O4S2/c1-34(31,32)27-14(29)16(12-5-3-2-4-6-12)7-9-28(10-8-16)15-26-11-13(33-15)17(30,18(20,21)22)19(23,24)25/h2-6,11,30H,7-10H2,1H3,(H,27,29)
Reactome pathway
n/an/an/an/a 500n/an/an/an/a
Merck Research Laboratories
Curated by ChEMBL
Assay Description
Inhibition of MCD in mouse hepatocytes by whole cell assay
Bioorg Med Chem Lett 20: 6088-92 (2010)
Article DOI: 10.1016/j.bmcl.2010.08.047
BindingDB Entry DOI: 10.7270/Q2542NTX
Malonyl-CoA decarboxylase
(Homo sapiens (Human))
BDBM50328248
(1-(5-(1,1,1,3,3,3-hexafluoro-2-hydroxypropan-2-yl)...)
Show SMILES CS(=O)(=O)NC(=O)C1(CCN(CC1)c1ncc(s1)C(O)(C(F)(F)F)C(F)(F)F)c1ccccc1
Show InChI InChI=1S/C19H19F6N3O4S2/c1-34(31,32)27-14(29)16(12-5-3-2-4-6-12)7-9-28(10-8-16)15-26-11-13(33-15)17(30,18(20,21)22)19(23,24)25/h2-6,11,30H,7-10H2,1H3,(H,27,29)
Reactome pathway
n/an/a 0.900n/an/an/an/an/an/a
Merck Research Laboratories
Curated by ChEMBL
Assay Description
Inhibition of human MCD
Bioorg Med Chem Lett 20: 6088-92 (2010)
Article DOI: 10.1016/j.bmcl.2010.08.047
BindingDB Entry DOI: 10.7270/Q2542NTX