BDBM50328260 5-(2-chlorophenyl)-7-nitro-2,10-dihydrobenzo[e]pyrazolo[4,3-b][1,4]diazepine::CHEMBL1258702
SMILES: [O-][N+](=O)c1ccc2Nc3[nH]ncc3N=C(c3ccccc3Cl)c2c1
InChI Key: InChIKey=JOBYRTMUHJKCCU-UHFFFAOYSA-N
Data: 1 IC50
Activity Spreadsheet -- Enzyme Inhibition Constant Data from BindingDB
Found 1 hit for monomerid = 50328260
Trg + Lig
Ki
nM
ΔG°
kcal/mole
IC50
nM
Kd
nM
EC50/IC50
nM
koff
s-1
kon
M-1s-1
pHTemp
°C
CDK2/Cyclin E/G1/S-specific cyclin E2
(Homo sapiens (Human))
BDBM50328260
(5-(2-chlorophenyl)-7-nitro-2,10-dihydrobenzo[e]pyr...)
Show SMILES [O-][N+](=O)c1ccc2Nc3[nH]ncc3N=C(c3ccccc3Cl)c2c1 |t:14|
Show InChI InChI=1S/C16H10ClN5O2/c17-12-4-2-1-3-10(12)15-11-7-9(22(23)24)5-6-13(11)20-16-14(19-15)8-18-21-16/h1-8H,(H2,18,20,21)
n/an/a 70n/an/an/an/an/an/a
Hoffmann-La Roche Inc.
Curated by ChEMBL
Assay Description
Inhibition of CDK2-cyclin E
Bioorg Med Chem Lett 20: 5984-7 (2010)
Article DOI: 10.1016/j.bmcl.2010.08.079
BindingDB Entry DOI: 10.7270/Q21C1X42