BDBM50328396 (Z)-3-(azulen-1-ylmethylene)-5-methylindolin-2-one::CHEMBL1257682
SMILES: Cc1ccc2NC(=O)\C(=C/c3ccc4cccccc34)c2c1
InChI Key: InChIKey=MBPQUHCWDKKYGR-PDGQHHTCSA-N
Data: 1 IC50
Activity Spreadsheet -- Enzyme Inhibition Constant Data from BindingDB
Found 1 hit for monomerid = 50328396
Trg + Lig
Ki
nM
ΔG°
kcal/mole
IC50
nM
Kd
nM
EC50/IC50
nM
koff
s-1
kon
M-1s-1
pHTemp
°C
Receptor-type tyrosine-protein kinase FLT3
(Homo sapiens (Human))
BDBM50328396
((Z)-3-(azulen-1-ylmethylene)-5-methylindolin-2-one...)
Show SMILES Cc1ccc2NC(=O)\C(=C/c3ccc4cccccc34)c2c1
Show InChI InChI=1S/C20H15NO/c1-13-7-10-19-17(11-13)18(20(22)21-19)12-15-9-8-14-5-3-2-4-6-16(14)15/h2-12H,1H3,(H,21,22)/b18-12-
n/an/a>1.00E+3n/an/an/an/an/an/a
Industrial Technology Research Institute
Curated by ChEMBL
Assay Description
Inhibition of FLT3 by time resolved fluorescence method
Bioorg Med Chem Lett 20: 6129-32 (2010)
Article DOI: 10.1016/j.bmcl.2010.08.025
BindingDB Entry DOI: 10.7270/Q2N29X51