BDBM50328752 5-amino-3-((3-chloro-2-hydroxy-5-nitrophenyl)diazenyl)-4-hydroxynaphthalene-2,7-disulfonate::CHEMBL1269835
SMILES: Nc1cc(cc2cc(c(N=Nc3cc(cc(Cl)c3O)[N+]([O-])=O)c(O)c12)S([O-])(=O)=O)S([O-])(=O)=O
InChI Key: InChIKey=YWVCYGLMOFNBMY-UHFFFAOYSA-L
Data: 1 IC50
Activity Spreadsheet -- Enzyme Inhibition Constant Data from BindingDB
Found 1 hit for monomerid = 50328752
Trg + Lig
Ki
nM
ΔG°
kcal/mole
IC50
nM
Kd
nM
EC50/IC50
nM
koff
s-1
kon
M-1s-1
pHTemp
°C
Protein-arginine N-methyltransferase 1
(Homo sapiens (Human))
BDBM50328752
(5-amino-3-((3-chloro-2-hydroxy-5-nitrophenyl)diaze...)
Show SMILES Nc1cc(cc2cc(c(N=Nc3cc(cc(Cl)c3O)[N+]([O-])=O)c(O)c12)S([O-])(=O)=O)S([O-])(=O)=O |w:9.8|
Show InChI InChI=1S/C16H11ClN4O10S2/c17-9-3-7(21(24)25)4-11(15(9)22)19-20-14-12(33(29,30)31)2-6-1-8(32(26,27)28)5-10(18)13(6)16(14)23/h1-5,22-23H,18H2,(H,26,27,28)(H,29,30,31)/p-2
n/an/a 2.81E+5n/an/an/an/an/an/a
Georgia State University
Curated by ChEMBL
Assay Description
Inhibition of His6x-tagged PRMT1-mediated protein arginine methylation expressed in Escherichia coli BL21 (DE3) using H4(1-20) and [14C]-SAM by scint...
J Med Chem 53: 6028-39 (2010)
Article DOI: 10.1021/jm100416n
BindingDB Entry DOI: 10.7270/Q2251JDB