BDBM50328766 1-(3-tert-butyl-1-(4-(hydroxymethyl)phenyl)-1H-pyrazol-5-yl)-3-(naphthalen-1-yl)urea::CHEMBL1271167
SMILES: CC(C)(C)c1cc(NC(=O)Nc2cccc3ccccc23)n(n1)-c1ccc(CO)cc1
InChI Key: InChIKey=MKYJHFRHAZBFKJ-UHFFFAOYSA-N
Data: 1 IC50
PDB links: 1 PDB ID matches this monomer.
Activity Spreadsheet -- Enzyme Inhibition Constant Data from BindingDB
Found 1 hit for monomerid = 50328766
Trg + Lig
Ki
nM
ΔG°
kcal/mole
IC50
nM
Kd
nM
EC50/IC50
nM
koff
s-1
kon
M-1s-1
pHTemp
°C
Mitogen-activated protein kinase 14
(Homo sapiens (Human))
BDBM50328766
(1-(3-tert-butyl-1-(4-(hydroxymethyl)phenyl)-1H-pyr...)
Show SMILES CC(C)(C)c1cc(NC(=O)Nc2cccc3ccccc23)n(n1)-c1ccc(CO)cc1
Show InChI InChI=1S/C25H26N4O2/c1-25(2,3)22-15-23(29(28-22)19-13-11-17(16-30)12-14-19)27-24(31)26-21-10-6-8-18-7-4-5-9-20(18)21/h4-15,30H,16H2,1-3H3,(H2,26,27,31)
NCI pathway
Reactome pathway
n/an/a 27n/an/an/an/an/an/a
Deciphera Pharmaceuticals LLC
Curated by ChEMBL
Assay Description
Inhibition of p38alpha by fluoroprobe binding assay
Bioorg Med Chem Lett 20: 5793-8 (2010)
Article DOI: 10.1016/j.bmcl.2010.07.134
BindingDB Entry DOI: 10.7270/Q2XD11WK
3D
3D Structure (crystal)