BDBM50328769 2-(3-(3-tert-butyl-5-(3-naphthalen-1-ylureido)-1H-pyrazol-1-yl)phenyl)acetamide::CHEMBL1271269
SMILES: CC(C)(C)c1cc(NC(=O)Nc2cccc3ccccc23)n(n1)-c1cccc(CC(N)=O)c1
InChI Key: InChIKey=WAICXQPLFJULIM-UHFFFAOYSA-N
Data: 2 IC50
Activity Spreadsheet -- Enzyme Inhibition Constant Data from BindingDB
Found 2 hits for monomerid = 50328769
Trg + Lig
Ki
nM
ΔG°
kcal/mole
IC50
nM
Kd
nM
EC50/IC50
nM
koff
s-1
kon
M-1s-1
pHTemp
°C
Mitogen-activated protein kinase 14
(Homo sapiens (Human))
BDBM50328769
(2-(3-(3-tert-butyl-5-(3-naphthalen-1-ylureido)-1H-...)
Show SMILES CC(C)(C)c1cc(NC(=O)Nc2cccc3ccccc23)n(n1)-c1cccc(CC(N)=O)c1
Show InChI InChI=1S/C26H27N5O2/c1-26(2,3)22-16-24(31(30-22)19-11-6-8-17(14-19)15-23(27)32)29-25(33)28-21-13-7-10-18-9-4-5-12-20(18)21/h4-14,16H,15H2,1-3H3,(H2,27,32)(H2,28,29,33)
NCI pathway
Reactome pathway
n/an/a 22n/an/an/an/an/an/a
Deciphera Pharmaceuticals LLC
Curated by ChEMBL
Assay Description
Binding affinity to phosphorylated p38alpha by fluoroprobe binding assay
Bioorg Med Chem Lett 20: 5793-8 (2010)
Article DOI: 10.1016/j.bmcl.2010.07.134
BindingDB Entry DOI: 10.7270/Q2XD11WK
Mitogen-activated protein kinase 14
(Homo sapiens (Human))
BDBM50328769
(2-(3-(3-tert-butyl-5-(3-naphthalen-1-ylureido)-1H-...)
Show SMILES CC(C)(C)c1cc(NC(=O)Nc2cccc3ccccc23)n(n1)-c1cccc(CC(N)=O)c1
Show InChI InChI=1S/C26H27N5O2/c1-26(2,3)22-16-24(31(30-22)19-11-6-8-17(14-19)15-23(27)32)29-25(33)28-21-13-7-10-18-9-4-5-12-20(18)21/h4-14,16H,15H2,1-3H3,(H2,27,32)(H2,28,29,33)
NCI pathway
Reactome pathway
n/an/a 16n/an/an/an/an/an/a
Deciphera Pharmaceuticals LLC
Curated by ChEMBL
Assay Description
Binding affinity to unphosphorylated p38alpha by fluoroprobe binding assay
Bioorg Med Chem Lett 20: 5793-8 (2010)
Article DOI: 10.1016/j.bmcl.2010.07.134
BindingDB Entry DOI: 10.7270/Q2XD11WK