BDBM50328805 CHEMBL1269952::rac-1,2,5-trimethyl-4-(2-(naphthalen-1-yl)vinyl)piperidin-4-ol
SMILES: CC1CC(O)(\C=C\c2cccc3ccccc23)C(C)CN1C
InChI Key: InChIKey=SFCXMYLLNIDIPQ-VAWYXSNFSA-N
Data: 2 IC50
Activity Spreadsheet -- Enzyme Inhibition Constant Data from BindingDB
Found 2 hits for monomerid = 50328805
Trg + Lig
Ki
nM
ΔG°
kcal/mole
IC50
nM
Kd
nM
EC50/IC50
nM
koff
s-1
kon
M-1s-1
pHTemp
°C
Histamine H3 receptor
(Homo sapiens (Human))
BDBM50328805
(CHEMBL1269952 | rac-1,2,5-trimethyl-4-(2-(naphthal...)
Show SMILES CC1CC(O)(\C=C\c2cccc3ccccc23)C(C)CN1C
Show InChI InChI=1S/C20H25NO/c1-15-14-21(3)16(2)13-20(15,22)12-11-18-9-6-8-17-7-4-5-10-19(17)18/h4-12,15-16,22H,13-14H2,1-3H3/b12-11+
Reactome pathway
n/an/a 20n/an/an/an/an/an/a
Athersys Inc.
Curated by ChEMBL
Assay Description
Antagonist activity against human histamine H3 receptor expressed in human HT1080 cells assessed as inhibition of (R)-alpha-methylhistamine-induced i...
Bioorg Med Chem Lett 20: 6246-9 (2010)
Article DOI: 10.1016/j.bmcl.2010.08.099
BindingDB Entry DOI: 10.7270/Q2DF6RGG
Histamine H3 receptor
(Mus musculus)
BDBM50328805
(CHEMBL1269952 | rac-1,2,5-trimethyl-4-(2-(naphthal...)
Show SMILES CC1CC(O)(\C=C\c2cccc3ccccc23)C(C)CN1C
Show InChI InChI=1S/C20H25NO/c1-15-14-21(3)16(2)13-20(15,22)12-11-18-9-6-8-17-7-4-5-10-19(17)18/h4-12,15-16,22H,13-14H2,1-3H3/b12-11+
Reactome pathway
n/an/a 570n/an/an/an/an/an/a
Athersys Inc.
Curated by ChEMBL
Assay Description
Antagonist activity against mouse histamine H3 receptor expressed in human HT1080 cells assessed as inhibition of (R)-alpha-methylhistamine-induced i...
Bioorg Med Chem Lett 20: 6246-9 (2010)
Article DOI: 10.1016/j.bmcl.2010.08.099
BindingDB Entry DOI: 10.7270/Q2DF6RGG