BDBM50328874 (3R,4S)-N-(2-chloro-5-(2-(methylamino)-2-oxoethyl)benzyl)-N-cyclopropyl-4-(4-(2-(2,6-dichloro-4-methylphenoxy)ethoxy)phenyl)piperidine-3-carboxamide::CHEMBL1269688
SMILES: CNC(=O)Cc1ccc(Cl)c(CN(C2CC2)C(=O)[C@H]2CNCC[C@@H]2c2ccc(OCCOc3c(Cl)cc(C)cc3Cl)cc2)c1
InChI Key: InChIKey=FWJNQLUVJYSKHC-IZLXSDGUSA-N
Data: 2 IC50
Activity Spreadsheet -- Enzyme Inhibition Constant Data from BindingDB
Found 2 hits for monomerid = 50328874
Trg + Lig
Ki
nM
ΔG°
kcal/mole
IC50
nM
Kd
nM
EC50/IC50
nM
koff
s-1
kon
M-1s-1
pHTemp
°C
Renin
(Homo sapiens (Human))
BDBM50328874
((3R,4S)-N-(2-chloro-5-(2-(methylamino)-2-oxoethyl)...)
Show SMILES CNC(=O)Cc1ccc(Cl)c(CN(C2CC2)C(=O)[C@H]2CNCC[C@@H]2c2ccc(OCCOc3c(Cl)cc(C)cc3Cl)cc2)c1 |r|
Show InChI InChI=1S/C34H38Cl3N3O4/c1-21-15-30(36)33(31(37)16-21)44-14-13-43-26-8-4-23(5-9-26)27-11-12-39-19-28(27)34(42)40(25-6-7-25)20-24-17-22(3-10-29(24)35)18-32(41)38-2/h3-5,8-10,15-17,25,27-28,39H,6-7,11-14,18-20H2,1-2H3,(H,38,41)/t27-,28+/m1/s1
Reactome pathway
n/an/a 0.110n/an/an/an/an/an/a
Actelion Pharmaceuticals Ltd
Curated by ChEMBL
Assay Description
Inhibition of renin in plasma
Bioorg Med Chem Lett 20: 6286-90 (2010)
Article DOI: 10.1016/j.bmcl.2010.08.086
BindingDB Entry DOI: 10.7270/Q2WD40T3
Renin
(Homo sapiens (Human))
BDBM50328874
((3R,4S)-N-(2-chloro-5-(2-(methylamino)-2-oxoethyl)...)
Show SMILES CNC(=O)Cc1ccc(Cl)c(CN(C2CC2)C(=O)[C@H]2CNCC[C@@H]2c2ccc(OCCOc3c(Cl)cc(C)cc3Cl)cc2)c1 |r|
Show InChI InChI=1S/C34H38Cl3N3O4/c1-21-15-30(36)33(31(37)16-21)44-14-13-43-26-8-4-23(5-9-26)27-11-12-39-19-28(27)34(42)40(25-6-7-25)20-24-17-22(3-10-29(24)35)18-32(41)38-2/h3-5,8-10,15-17,25,27-28,39H,6-7,11-14,18-20H2,1-2H3,(H,38,41)/t27-,28+/m1/s1
Reactome pathway
n/an/a 3.40n/an/an/an/an/an/a
Actelion Pharmaceuticals Ltd
Curated by ChEMBL
Assay Description
Inhibition of renin in plasma
Bioorg Med Chem Lett 20: 6286-90 (2010)
Article DOI: 10.1016/j.bmcl.2010.08.086
BindingDB Entry DOI: 10.7270/Q2WD40T3