BDBM50328884 4-(3-(methylamino)propyl)-6-(3-(trifluoromethyl)phenyl)pyrimidine-2-carbonitrile::CHEMBL1271380
SMILES: CNCCCc1cc(nc(n1)C#N)-c1cccc(c1)C(F)(F)F
InChI Key: InChIKey=VOWUIFRLUKZWRM-UHFFFAOYSA-N
Data: 1 KI  1 IC50
Activity Spreadsheet -- Enzyme Inhibition Constant Data from BindingDB
Found 2 hits for monomerid = 50328884
Trg + Lig
Ki
nM
ΔG°
kcal/mole
IC50
nM
Kd
nM
EC50/IC50
nM
koff
s-1
kon
M-1s-1
pHTemp
°C
Potassium voltage-gated channel subfamily H member 2
(Homo sapiens (Human))
BDBM50328884
(4-(3-(methylamino)propyl)-6-(3-(trifluoromethyl)ph...)
Show SMILES CNCCCc1cc(nc(n1)C#N)-c1cccc(c1)C(F)(F)F
Show InChI InChI=1S/C16H15F3N4/c1-21-7-3-6-13-9-14(23-15(10-20)22-13)11-4-2-5-12(8-11)16(17,18)19/h2,4-5,8-9,21H,3,6-7H2,1H3
Reactome pathway
630n/an/an/an/an/an/an/an/a
Merck Research Laboratories
Curated by ChEMBL
Assay Description
Displacement of [3H] dofetilide from human ERG channel expressed in HEK293 cells
Bioorg Med Chem Lett 20: 6237-41 (2010)
Article DOI: 10.1016/j.bmcl.2010.08.101
BindingDB Entry DOI: 10.7270/Q2RR1ZFT
Cathepsin K
(Homo sapiens (Human))
BDBM50328884
(4-(3-(methylamino)propyl)-6-(3-(trifluoromethyl)ph...)
Show SMILES CNCCCc1cc(nc(n1)C#N)-c1cccc(c1)C(F)(F)F
Show InChI InChI=1S/C16H15F3N4/c1-21-7-3-6-13-9-14(23-15(10-20)22-13)11-4-2-5-12(8-11)16(17,18)19/h2,4-5,8-9,21H,3,6-7H2,1H3
Reactome pathway
n/an/a 6n/an/an/an/an/an/a
Merck Research Laboratories
Curated by ChEMBL
Assay Description
Inhibition of human recombinant cathepsin K using Z-Phe-Arg-MCA substrate by fluorimetric assay
Bioorg Med Chem Lett 20: 6237-41 (2010)
Article DOI: 10.1016/j.bmcl.2010.08.101
BindingDB Entry DOI: 10.7270/Q2RR1ZFT