null
SMILES: FC(F)(F)c1cccc(c1)-c1cc(CCCNc2ccccn2)nc(n1)C#N
InChI Key: InChIKey=CXDMEJPMIGCWHH-UHFFFAOYSA-N
Activity Spreadsheet -- Enzyme Inhibition Constant Data from BindingDB
Found 2 hits for monomerid = 50328890
Trg + Lig
Ki
nM
ΔG°
kcal/mole
IC50
nM
Kd
nM
EC50/IC50
nM
koff
s-1
kon
M-1s-1
pHTemp
°C
Cathepsin K
(Homo sapiens (Human))
BDBM50328890
(4-(3-(pyridin-2-ylamino)propyl)-6-(3-(trifluoromet...)
Show SMILES FC(F)(F)c1cccc(c1)-c1cc(CCCNc2ccccn2)nc(n1)C#N
Show InChI InChI=1S/C20H16F3N5/c21-20(22,23)15-6-3-5-14(11-15)17-12-16(27-19(13-24)28-17)7-4-10-26-18-8-1-2-9-25-18/h1-3,5-6,8-9,11-12H,4,7,10H2,(H,25,26)
Reactome pathway
n/an/a 3n/an/an/an/an/an/a
Merck Research Laboratories
Curated by ChEMBL
Assay Description
Inhibition of human recombinant cathepsin K using Z-Phe-Arg-MCA substrate by fluorimetric assay
Bioorg Med Chem Lett 20: 6237-41 (2010)
Article DOI: 10.1016/j.bmcl.2010.08.101
BindingDB Entry DOI: 10.7270/Q2RR1ZFT
Potassium voltage-gated channel subfamily H member 2
(Homo sapiens (Human))
BDBM50328890
(4-(3-(pyridin-2-ylamino)propyl)-6-(3-(trifluoromet...)
Show SMILES FC(F)(F)c1cccc(c1)-c1cc(CCCNc2ccccn2)nc(n1)C#N
Show InChI InChI=1S/C20H16F3N5/c21-20(22,23)15-6-3-5-14(11-15)17-12-16(27-19(13-24)28-17)7-4-10-26-18-8-1-2-9-25-18/h1-3,5-6,8-9,11-12H,4,7,10H2,(H,25,26)
Reactome pathway
400n/an/an/an/an/an/an/an/a
Merck Research Laboratories
Curated by ChEMBL
Assay Description
Displacement of [3H] dofetilide from human ERG channel expressed in HEK293 cells
Bioorg Med Chem Lett 20: 6237-41 (2010)
Article DOI: 10.1016/j.bmcl.2010.08.101
BindingDB Entry DOI: 10.7270/Q2RR1ZFT