BDBM50328891 2-(3-(2-cyano-6-(3-(trifluoromethyl)phenyl)pyrimidin-4-yl)propylamino)acetic acid::CHEMBL1270170
SMILES: OC(=O)CNCCCc1cc(nc(n1)C#N)-c1cccc(c1)C(F)(F)F
InChI Key: InChIKey=XMLIWPSXHXPJCO-UHFFFAOYSA-N
Data: 1 KI  1 IC50
Activity Spreadsheet -- Enzyme Inhibition Constant Data from BindingDB
Found 2 hits for monomerid = 50328891
Trg + Lig
Ki
nM
ΔG°
kcal/mole
IC50
nM
Kd
nM
EC50/IC50
nM
koff
s-1
kon
M-1s-1
pHTemp
°C
Potassium voltage-gated channel subfamily H member 2
(Homo sapiens (Human))
BDBM50328891
(2-(3-(2-cyano-6-(3-(trifluoromethyl)phenyl)pyrimid...)
Show SMILES OC(=O)CNCCCc1cc(nc(n1)C#N)-c1cccc(c1)C(F)(F)F
Show InChI InChI=1S/C17H15F3N4O2/c18-17(19,20)12-4-1-3-11(7-12)14-8-13(23-15(9-21)24-14)5-2-6-22-10-16(25)26/h1,3-4,7-8,22H,2,5-6,10H2,(H,25,26)
Reactome pathway
>1.00E+4n/an/an/an/an/an/an/an/a
Merck Research Laboratories
Curated by ChEMBL
Assay Description
Displacement of [3H] dofetilide from human ERG channel expressed in HEK293 cells
Bioorg Med Chem Lett 20: 6237-41 (2010)
Article DOI: 10.1016/j.bmcl.2010.08.101
BindingDB Entry DOI: 10.7270/Q2RR1ZFT
Cathepsin K
(Homo sapiens (Human))
BDBM50328891
(2-(3-(2-cyano-6-(3-(trifluoromethyl)phenyl)pyrimid...)
Show SMILES OC(=O)CNCCCc1cc(nc(n1)C#N)-c1cccc(c1)C(F)(F)F
Show InChI InChI=1S/C17H15F3N4O2/c18-17(19,20)12-4-1-3-11(7-12)14-8-13(23-15(9-21)24-14)5-2-6-22-10-16(25)26/h1,3-4,7-8,22H,2,5-6,10H2,(H,25,26)
Reactome pathway
n/an/a 9n/an/an/an/an/an/a
Merck Research Laboratories
Curated by ChEMBL
Assay Description
Inhibition of human recombinant cathepsin K using Z-Phe-Arg-MCA substrate by fluorimetric assay
Bioorg Med Chem Lett 20: 6237-41 (2010)
Article DOI: 10.1016/j.bmcl.2010.08.101
BindingDB Entry DOI: 10.7270/Q2RR1ZFT
3D
3D Structure (docked)