BDBM50328967 CHEMBL1269776::N-{11-[(11-Aminoundecyl)(methyl)amino]undecyl}-5-(4-chlorophenyl)-1-(2,4-dichlorophenyl)-4-methyl-1H-pyrazole-3-carboxamide
SMILES: CN(CCCCCCCCCCCN)CCCCCCCCCCCNC(=O)c1nn(c(c1C)-c1ccc(Cl)cc1)-c1ccc(Cl)cc1Cl
InChI Key: InChIKey=JTLZKYIJFISRSZ-UHFFFAOYSA-N
Data: 3 KI  1 EC50
Activity Spreadsheet -- Enzyme Inhibition Constant Data from BindingDB
Found 4 hits for monomerid = 50328967
Trg + Lig
Ki
nM
ΔG°
kcal/mole
IC50
nM
Kd
nM
EC50/IC50
nM
koff
s-1
kon
M-1s-1
pHTemp
°C
Cannabinoid receptor 1
(Homo sapiens (Human))
BDBM50328967
(CHEMBL1269776 | N-{11-[(11-Aminoundecyl)(methyl)am...)
Show SMILES CN(CCCCCCCCCCCN)CCCCCCCCCCCNC(=O)c1nn(c(c1C)-c1ccc(Cl)cc1)-c1ccc(Cl)cc1Cl
Show InChI InChI=1S/C40H60Cl3N5O/c1-32-38(46-48(37-26-25-35(42)31-36(37)43)39(32)33-21-23-34(41)24-22-33)40(49)45-28-18-14-10-6-4-8-12-16-20-30-47(2)29-19-15-11-7-3-5-9-13-17-27-44/h21-26,31H,3-20,27-30,44H2,1-2H3,(H,45,49)
NCI pathway
Reactome pathway
5.51n/an/an/an/an/an/an/an/a
Research Triangle Institute
Curated by ChEMBL
Assay Description
Displacement of [3H]SR141716 from human CB1 receptor expressed in HEK293 cells
J Med Chem 53: 7048-60 (2010)
Article DOI: 10.1021/jm1006676
BindingDB Entry DOI: 10.7270/Q27P8ZMC
Cannabinoid receptor 1
(Homo sapiens (Human))
BDBM50328967
(CHEMBL1269776 | N-{11-[(11-Aminoundecyl)(methyl)am...)
Show SMILES CN(CCCCCCCCCCCN)CCCCCCCCCCCNC(=O)c1nn(c(c1C)-c1ccc(Cl)cc1)-c1ccc(Cl)cc1Cl
Show InChI InChI=1S/C40H60Cl3N5O/c1-32-38(46-48(37-26-25-35(42)31-36(37)43)39(32)33-21-23-34(41)24-22-33)40(49)45-28-18-14-10-6-4-8-12-16-20-30-47(2)29-19-15-11-7-3-5-9-13-17-27-44/h21-26,31H,3-20,27-30,44H2,1-2H3,(H,45,49)
NCI pathway
Reactome pathway
14.7n/an/an/an/an/an/an/an/a
Research Triangle Institute
Curated by ChEMBL
Assay Description
Displacement of [3H]CP55940 from human CB1 receptor expressed in HEK293 cells
J Med Chem 53: 7048-60 (2010)
Article DOI: 10.1021/jm1006676
BindingDB Entry DOI: 10.7270/Q27P8ZMC
Cannabinoid receptor 2
(Homo sapiens (Human))
BDBM50328967
(CHEMBL1269776 | N-{11-[(11-Aminoundecyl)(methyl)am...)
Show SMILES CN(CCCCCCCCCCCN)CCCCCCCCCCCNC(=O)c1nn(c(c1C)-c1ccc(Cl)cc1)-c1ccc(Cl)cc1Cl
Show InChI InChI=1S/C40H60Cl3N5O/c1-32-38(46-48(37-26-25-35(42)31-36(37)43)39(32)33-21-23-34(41)24-22-33)40(49)45-28-18-14-10-6-4-8-12-16-20-30-47(2)29-19-15-11-7-3-5-9-13-17-27-44/h21-26,31H,3-20,27-30,44H2,1-2H3,(H,45,49)
Reactome pathway
426n/an/an/an/an/an/an/an/a
Research Triangle Institute
Curated by ChEMBL
Assay Description
Displacement of [3H]CP55940 from human CB2 receptor expressed in CHOK1 cells
J Med Chem 53: 7048-60 (2010)
Article DOI: 10.1021/jm1006676
BindingDB Entry DOI: 10.7270/Q27P8ZMC
Cannabinoid receptor 1
(Rattus norvegicus (rat))
BDBM50328967
(CHEMBL1269776 | N-{11-[(11-Aminoundecyl)(methyl)am...)
Show SMILES CN(CCCCCCCCCCCN)CCCCCCCCCCCNC(=O)c1nn(c(c1C)-c1ccc(Cl)cc1)-c1ccc(Cl)cc1Cl
Show InChI InChI=1S/C40H60Cl3N5O/c1-32-38(46-48(37-26-25-35(42)31-36(37)43)39(32)33-21-23-34(41)24-22-33)40(49)45-28-18-14-10-6-4-8-12-16-20-30-47(2)29-19-15-11-7-3-5-9-13-17-27-44/h21-26,31H,3-20,27-30,44H2,1-2H3,(H,45,49)
Reactome pathway
n/an/an/an/a 8.77E+3n/an/an/an/a
Research Triangle Institute
Curated by ChEMBL
Assay Description
Antagonist activity at rat brain CB1 receptor assessed as inhibition of [35S]GTPgammaS binding
J Med Chem 53: 7048-60 (2010)
Article DOI: 10.1021/jm1006676
BindingDB Entry DOI: 10.7270/Q27P8ZMC