BDBM50329057 CHEMBL1270773::N4-(benzo[d]oxazol-7-yl)-N2-(3-(methylsulfonyl)phenyl)pyrimidine-2,4-diamine
SMILES: CS(=O)(=O)c1cccc(Nc2nccc(Nc3cccc4ncoc34)n2)c1
InChI Key: InChIKey=KZCPXMFKBLMRRN-UHFFFAOYSA-N
Data: 2 IC50
Activity Spreadsheet -- Enzyme Inhibition Constant Data from BindingDB
Found 2 hits for monomerid = 50329057
Trg + Lig
Ki
nM
ΔG°
kcal/mole
IC50
nM
Kd
nM
EC50/IC50
nM
koff
s-1
kon
M-1s-1
pHTemp
°C
Ephrin type-B receptor 4
(Homo sapiens (Human))
BDBM50329057
(CHEMBL1270773 | N4-(benzo[d]oxazol-7-yl)-N2-(3-(me...)
Show SMILES CS(=O)(=O)c1cccc(Nc2nccc(Nc3cccc4ncoc34)n2)c1
Show InChI InChI=1S/C18H15N5O3S/c1-27(24,25)13-5-2-4-12(10-13)21-18-19-9-8-16(23-18)22-15-7-3-6-14-17(15)26-11-20-14/h2-11H,1H3,(H2,19,21,22,23)
Reactome pathway
n/an/a 1.35E+3n/an/an/an/an/an/a
AstraZeneca
Curated by ChEMBL
Assay Description
Inhibition of EphB4 autophosphorylation expressed in CHOK1 cells
Bioorg Med Chem Lett 20: 6242-5 (2010)
Article DOI: 10.1016/j.bmcl.2010.08.100
BindingDB Entry DOI: 10.7270/Q2QR4XCB
Ephrin type-B receptor 4
(Homo sapiens (Human))
BDBM50329057
(CHEMBL1270773 | N4-(benzo[d]oxazol-7-yl)-N2-(3-(me...)
Show SMILES CS(=O)(=O)c1cccc(Nc2nccc(Nc3cccc4ncoc34)n2)c1
Show InChI InChI=1S/C18H15N5O3S/c1-27(24,25)13-5-2-4-12(10-13)21-18-19-9-8-16(23-18)22-15-7-3-6-14-17(15)26-11-20-14/h2-11H,1H3,(H2,19,21,22,23)
Reactome pathway
n/an/a 219n/an/an/an/an/an/a
AstraZeneca
Curated by ChEMBL
Assay Description
Inhibition of EphB4 by acoustic dispensing assay
Bioorg Med Chem Lett 20: 6242-5 (2010)
Article DOI: 10.1016/j.bmcl.2010.08.100
BindingDB Entry DOI: 10.7270/Q2QR4XCB