BDBM50329074 3-(4-((1H-indazol-4-yl)(methyl)amino)pyrimidin-2-ylamino)-N,N-dimethylbenzamide::CHEMBL1270075
SMILES: CN(C)C(=O)c1cccc(Nc2nccc(n2)N(C)c2cccc3[nH]ncc23)c1
InChI Key: InChIKey=AXNPQTPNOPBAQE-UHFFFAOYSA-N
Data: 2 IC50
Activity Spreadsheet -- Enzyme Inhibition Constant Data from BindingDB
Found 2 hits for monomerid = 50329074
Trg + Lig
Ki
nM
ΔG°
kcal/mole
IC50
nM
Kd
nM
EC50/IC50
nM
koff
s-1
kon
M-1s-1
pHTemp
°C
Ephrin type-B receptor 4
(Homo sapiens (Human))
BDBM50329074
(3-(4-((1H-indazol-4-yl)(methyl)amino)pyrimidin-2-y...)
Show SMILES CN(C)C(=O)c1cccc(Nc2nccc(n2)N(C)c2cccc3[nH]ncc23)c1
Show InChI InChI=1S/C21H21N7O/c1-27(2)20(29)14-6-4-7-15(12-14)24-21-22-11-10-19(25-21)28(3)18-9-5-8-17-16(18)13-23-26-17/h4-13H,1-3H3,(H,23,26)(H,22,24,25)
Reactome pathway
n/an/a 453n/an/an/an/an/an/a
AstraZeneca
Curated by ChEMBL
Assay Description
Inhibition of EphB4 autophosphorylation expressed in CHOK1 cells
Bioorg Med Chem Lett 20: 6242-5 (2010)
Article DOI: 10.1016/j.bmcl.2010.08.100
BindingDB Entry DOI: 10.7270/Q2QR4XCB
Ephrin type-B receptor 4
(Homo sapiens (Human))
BDBM50329074
(3-(4-((1H-indazol-4-yl)(methyl)amino)pyrimidin-2-y...)
Show SMILES CN(C)C(=O)c1cccc(Nc2nccc(n2)N(C)c2cccc3[nH]ncc23)c1
Show InChI InChI=1S/C21H21N7O/c1-27(2)20(29)14-6-4-7-15(12-14)24-21-22-11-10-19(25-21)28(3)18-9-5-8-17-16(18)13-23-26-17/h4-13H,1-3H3,(H,23,26)(H,22,24,25)
Reactome pathway
n/an/a 29n/an/an/an/an/an/a
AstraZeneca
Curated by ChEMBL
Assay Description
Inhibition of EphB4 by acoustic dispensing assay
Bioorg Med Chem Lett 20: 6242-5 (2010)
Article DOI: 10.1016/j.bmcl.2010.08.100
BindingDB Entry DOI: 10.7270/Q2QR4XCB